{"text_format":"1","workbook":"xlsx","n_sheets":15,"sheets":["Instructions","Données de base","Entreprise A","Entreprise B","Entreprise C","Entreprise D","Entreprise E","1re année","2e année","3e année","4e année","Évaluation des salaires des dir","Évaluation des entreprises","Graphiques","Propositions de solutions"],"not_rendered":{"charts":6,"images":9,"macros":1,"external_links":0,"defined_names":0,"comments":0,"pivot_tables":0},"unopened":[],"bounds":{"document_bytes":16777216,"sheet_cells":100000,"rows_first":2000,"rows_last":500,"rows_between":2000,"halvings":0,"cell_chars":16384,"cell_head_chars":4096},"cells_cut":0,"cells_raw":0,"read":"whole","date_system":"1900"}

{"sheet":"Instructions","index":0,"n_rows":91,"n_cols":2,"rows_kept":91,"cut":false,"hidden":false,"merged":[[3,8,5,10],[7,0,8,8],[3,0,5,7],[29,1,33,7],[44,1,51,7],[10,0,23,7],[25,0,27,7],[35,1,38,7],[39,1,42,7],[90,0,91,7],[53,1,60,7],[62,1,70,7],[87,0,88,7],[83,0,85,7],[72,0,75,7],[77,0,81,7]]}
["Théorie des jeux - Hauts salaires"]
["Instructions pour l’évaluation du jeu éducatif sur les salaires des dirigeants"]
[]
["Remarque: Les règles du jeu se trouvent dans le document «Règles du jeu sur les salaires des dirigeants». Nous nous contentons d’expliquer ici les différentes étapes de l’évaluation du jeu. Les données de base du jeu se trouvent à l’onglet «Données de base»."]
[]
[]
[]
["Si vous avez déjà joué une première partie, vous devez remettre le jeu à zéro:"]
[]
[]
{"$rows_left_out":82}
{"sheet":"Données de base","index":1,"n_rows":18,"n_cols":3,"rows_kept":18,"cut":false,"hidden":false,"merged":[[3,0,3,2],[11,0,11,2],[12,1,12,2],[17,1,17,2],[16,1,16,2],[15,1,15,2],[14,1,14,2],[13,1,13,2]]}
["Théorie des jeux - Hauts salaires"]
["Données de base du jeu éducatif sur les salaires des dirigeants"]
[]
["Marché des dirigeants"]
["Dirigeants","Bénéfices bruts (en % du capital de l’entreprise) ","Salaire annuel"]
["Albert Adam",0.14000000000000001,"à négocier"]
["Bertha Binnig",0.13,"à négocier"]
["Claudia Custer",0.12,"à négocier"]
["Dieter Diem",0.11,"à négocier"]
["Cadre dirigeant/-e normal/-e",0.1,300000]
{"$rows_left_out":9}
{"sheet":"Entreprise A","index":2,"n_rows":22,"n_cols":7,"rows_kept":22,"cut":false,"hidden":false,"merged":[]}
["Théorie des jeux - Hauts salaires"]
["Jeu éducatif sur les salaires des dirigeants - Offres de l’entreprise A"]
[]
["Capitalisation:",{"$f":"'Données de base'!B14","v":5000000}]
[]
["1re année","Dirigeant-e","Salaire annuel",null,"3e année","Dirigeant-e","Salaire annuel"]
[null,"Albert Adam",null,null,null,"Albert Adam"]
[null,"Bertha Binnig",null,null,null,"Bertha Binnig"]
[null,"Claudia Custer",null,null,null,"Claudia Custer"]
[null,"Dieter Diem",null,null,null,"Dieter Diem"]
{"$rows_left_out":13}
{"sheet":"Entreprise B","index":3,"n_rows":22,"n_cols":7,"rows_kept":22,"cut":false,"hidden":false,"merged":[]}
["Théorie des jeux - Hauts salaires"]
["Jeu éducatif sur les salaires des dirigeants - Offres de l’entreprise B"]
[]
["Capitalisation:",{"$f":"'Données de base'!B15","v":10000000}]
[]
["1re année","Dirigeant-e","Salaire annuel",null,"3e année","Dirigeant-e","Salaire annuel"]
[null,"Albert Adam",null,null,null,"Albert Adam"]
[null,"Bertha Binnig",null,null,null,"Bertha Binnig"]
[null,"Claudia Custer",null,null,null,"Claudia Custer"]
[null,"Dieter Diem",null,null,null,"Dieter Diem"]
{"$rows_left_out":13}
{"sheet":"Entreprise C","index":4,"n_rows":22,"n_cols":7,"rows_kept":22,"cut":false,"hidden":false,"merged":[]}
["Théorie des jeux - Hauts salaires"]
["Jeu éducatif sur les salaires des dirigeants - Offres de l’entreprise C"]
[]
["Capitalisation:",{"$f":"'Données de base'!B16","v":30000000}]
[]
["1re année","Dirigeant-e","Salaire annuel",null,"3e année","Dirigeant-e","Salaire annuel"]
[null,"Albert Adam",null,null,null,"Albert Adam"]
[null,"Bertha Binnig",null,null,null,"Bertha Binnig"]
[null,"Claudia Custer",null,null,null,"Claudia Custer"]
[null,"Dieter Diem",null,null,null,"Dieter Diem"]
{"$rows_left_out":13}
{"sheet":"Entreprise D","index":5,"n_rows":22,"n_cols":7,"rows_kept":22,"cut":false,"hidden":false,"merged":[]}
["Théorie des jeux - Hauts salaires"]
["Jeu éducatif sur les salaires des dirigeants - Offres de l’entreprise D"]
[]
["Capitalisation:",{"$f":"'Données de base'!B17","v":400000000}]
[]
["1re année","Dirigeant-e","Salaire annuel",null,"3e année","Dirigeant-e","Salaire annuel"]
[null,"Albert Adam",null,null,null,"Albert Adam"]
[null,"Bertha Binnig",null,null,null,"Bertha Binnig"]
[null,"Claudia Custer",null,null,null,"Claudia Custer"]
[null,"Dieter Diem",null,null,null,"Dieter Diem"]
{"$rows_left_out":13}
{"sheet":"Entreprise E","index":6,"n_rows":28,"n_cols":7,"rows_kept":28,"cut":false,"hidden":false,"merged":[]}
["Théorie des jeux - Hauts salaires"]
["Jeu éducatif sur les salaires des dirigeants - Offres de l’entreprise E"]
[]
["Capitalisation:",{"$f":"'Données de base'!B18","v":7000000000}]
[]
["1re année","Dirigeant-e","Salaire annuel",null,"3e année","Dirigeant-e","Salaire annuel"]
[null,"Albert Adam",null,null,null,"Albert Adam"]
[null,"Bertha Binnig",null,null,null,"Bertha Binnig"]
[null,"Claudia Custer",null,null,null,"Claudia Custer"]
[null,"Dieter Diem",null,null,null,"Dieter Diem"]
{"$rows_left_out":19}
{"sheet":"1re année","index":7,"n_rows":42,"n_cols":13,"rows_kept":42,"cut":false,"hidden":false,"merged":[[8,7,8,9]]}
["Théorie des jeux - Hauts salaires"]
["Jeu éducatif sur les salaires des dirigeants - Affectation des dirigeants (1re année)"]
[]
["Offres la 1re année","Entreprise A","Entreprise B","Entreprise C","Entreprise D","Entreprise E",null,"Maximum","# Maxima","Tirage au sort "]
["Albert Adam",{"$f":"'Entreprise A'!C7","v":0},{"$f":"'Entreprise B'!C7","v":0},{"$f":"'Entreprise C'!C7","v":0},{"$f":"'Entreprise D'!C7","v":0},{"$f":"'Entreprise E'!C7","v":0},null,{"$f":"MAX(B5:F5)","v":0},{"$f":"COUNTIF(B5:F5,H5)","v":5},{"$f":"IF(I5>1,\"OUI\",\"NON\")","v":"OUI"},"NON"]
["Bertha Binnig",{"$f":"'Entreprise A'!C8","v":0},{"$f":"'Entreprise B'!C8","v":0},{"$f":"'Entreprise C'!C8","v":0},{"$f":"'Entreprise D'!C8","v":0},{"$f":"'Entreprise E'!C8","v":0},null,{"$f":"MAX(IF(B31:F31>1,IF(ISNUMBER(B31:F31)=TRUE,B6:F6)))","v":0},{"$f":"COUNTIFS(B6:F6,H6,B31:F31,\"<>1\",B31:F31,\"<>NA\")","v":0},{"$f":"IF(I6>1,\"OUI\",\"NON\")","v":"NON"},"NON"]
["Claudia Custer",{"$f":"'Entreprise A'!C9","v":0},{"$f":"'Entreprise B'!C9","v":0},{"$f":"'Entreprise C'!C9","v":0},{"$f":"'Entreprise D'!C9","v":0},{"$f":"'Entreprise E'!C9","v":0},null,{"$f":"MAX(IF(B32:F32>1,IF(ISNUMBER(B32:F32)=TRUE,B7:F7)))","v":0},{"$f":"COUNTIFS(B7:F7,H7,B32:F32,\"<>1\",B32:F32,\"<>NA\")","v":0},{"$f":"IF(I7>1,\"OUI\",\"NON\")","v":"NON"},"NON"]
["Dieter Diem",{"$f":"'Entreprise A'!C10","v":0},{"$f":"'Entreprise B'!C10","v":0},{"$f":"'Entreprise C'!C10","v":0},{"$f":"'Entreprise D'!C10","v":0},{"$f":"'Entreprise E'!C10","v":0},null,{"$f":"MAX(IF(B33:F33>1,IF(ISNUMBER(B33:F33)=TRUE,B8:F8)))","v":0},{"$f":"COUNTIFS(B8:F8,H8,B33:F33,\"<>1\",B33:F33,\"<>NA\")","v":0},{"$f":"IF(I8>1,\"OUI\",\"NON\")","v":"NON"},"NON"]
["Cadre dirigeant/-e normal/-e",{"$f":"'Entreprise A'!C11","v":300000},{"$f":"'Entreprise B'!C11","v":300000},{"$f":"'Entreprise C'!C11","v":300000},{"$f":"'Entreprise D'!C11","v":300000},{"$f":"'Entreprise E'!C11","v":300000},null,{"$f":"IF(K9=0,\"Vous n'avez pas / plus besoin de faire de tirage au sort!\",\"Vous devez procéder à encore un tirage au sort au moins!\")","v":"Vous devez procéder à encore un tirage au sort au moins!"},null,null,{"$f":"IF(OR(J5=\"OUI\",J6=\"OUI\",J7=\"OUI\",J8=\"OUI\"),IF(J5=K5,IF(J6=K6,IF(J7=K7,IF(J8=K8,0,1),1),1),1),0)","v":1}]
[]
{"$rows_left_out":33}
{"sheet":"2e année","index":8,"n_rows":42,"n_cols":13,"rows_kept":42,"cut":false,"hidden":false,"merged":[[8,7,8,9]]}
["Théorie des jeux - Hauts salaires"]
["Jeu éducatif sur les salaires des dirigeants - Affectation des dirigeants (2e année)"]
[]
["Offres la 2e année","Entreprise A","Entreprise B","Entreprise C","Entreprise D","Entreprise E",null,"Maximum","# Maxima","Tirage au sort"]
["Albert Adam",{"$f":"'Entreprise A'!C14","v":0},{"$f":"'Entreprise B'!C14","v":0},{"$f":"'Entreprise C'!C14","v":0},{"$f":"'Entreprise D'!C14","v":0},{"$f":"'Entreprise E'!C14","v":0},null,{"$f":"MAX(B5:F5)","v":0},{"$f":"COUNTIF(B5:F5,H5)","v":5},{"$f":"IF(I5>1,\"OUI\",\"NON\")","v":"OUI"},"NON"]
["Bertha Binnig",{"$f":"'Entreprise A'!C15","v":0},{"$f":"'Entreprise B'!C15","v":0},{"$f":"'Entreprise C'!C15","v":0},{"$f":"'Entreprise D'!C15","v":0},{"$f":"'Entreprise E'!C15","v":0},null,{"$f":"MAX(IF(B31:F31>1,IF(ISNUMBER(B31:F31)=TRUE,B6:F6)))","v":0},{"$f":"COUNTIFS(B6:F6,H6,B31:F31,\"<>1\",B31:F31,\"<>NA\")","v":0},{"$f":"IF(I6>1,\"OUI\",\"NON\")","v":"NON"},"NON"]
["Claudia Custer",{"$f":"'Entreprise A'!C16","v":0},{"$f":"'Entreprise B'!C16","v":0},{"$f":"'Entreprise C'!C16","v":0},{"$f":"'Entreprise D'!C16","v":0},{"$f":"'Entreprise E'!C16","v":0},null,{"$f":"MAX(IF(B32:F32>1,IF(ISNUMBER(B32:F32)=TRUE,B7:F7)))","v":0},{"$f":"COUNTIFS(B7:F7,H7,B32:F32,\"<>1\",B32:F32,\"<>NA\")","v":0},{"$f":"IF(I7>1,\"OUI\",\"NON\")","v":"NON"},"NON"]
["Dieter Diem",{"$f":"'Entreprise A'!C17","v":0},{"$f":"'Entreprise B'!C17","v":0},{"$f":"'Entreprise C'!C17","v":0},{"$f":"'Entreprise D'!C17","v":0},{"$f":"'Entreprise E'!C17","v":0},null,{"$f":"MAX(IF(B33:F33>1,IF(ISNUMBER(B33:F33)=TRUE,B8:F8)))","v":0},{"$f":"COUNTIFS(B8:F8,H8,B33:F33,\"<>1\",B33:F33,\"<>NA\")","v":0},{"$f":"IF(I8>1,\"OUI\",\"NON\")","v":"NON"},"NON"]
["Cadre dirigeant/-e normal/-e",{"$f":"'Entreprise A'!C18","v":300000},{"$f":"'Entreprise B'!C18","v":300000},{"$f":"'Entreprise C'!C18","v":300000},{"$f":"'Entreprise D'!C18","v":300000},{"$f":"'Entreprise E'!C18","v":300000},null,{"$f":"IF(K9=0,\"Vous n'avez pas / plus besoin de faire de tirage au sort!\",\"Vous devez procéder à encore un tirage au sort au moins!\")","v":"Vous devez procéder à encore un tirage au sort au moins!"},null,null,{"$f":"IF(OR(J5=\"OUI\",J6=\"OUI\",J7=\"OUI\",J8=\"OUI\"),IF(J5=K5,IF(J6=K6,IF(J7=K7,IF(J8=K8,0,1),1),1),1),0)","v":1}]
[]
{"$rows_left_out":33}
{"sheet":"3e année","index":9,"n_rows":42,"n_cols":13,"rows_kept":42,"cut":false,"hidden":false,"merged":[[8,7,8,9]]}
["Théorie des jeux - Hauts salaires"]
["Jeu éducatif sur les salaires des dirigeants - Affectation des dirigeants (3e année)"]
[]
["Offres la 3e année","Entreprise A","Entreprise B","Entreprise C","Entreprise D","Entreprise E",null,"Maximum","# Maxima","Tirage au sort"]
["Albert Adam",{"$f":"'Entreprise A'!G7","v":0},{"$f":"'Entreprise B'!G7","v":0},{"$f":"'Entreprise C'!G7","v":0},{"$f":"'Entreprise D'!G7","v":0},{"$f":"'Entreprise E'!G7","v":0},null,{"$f":"MAX(B5:F5)","v":0},{"$f":"COUNTIF(B5:F5,H5)","v":5},{"$f":"IF(I5>1,\"OUI\",\"NON\")","v":"OUI"},"NON"]
["Bertha Binnig",{"$f":"'Entreprise A'!G8","v":0},{"$f":"'Entreprise B'!G8","v":0},{"$f":"'Entreprise C'!G8","v":0},{"$f":"'Entreprise D'!G8","v":0},{"$f":"'Entreprise E'!G8","v":0},null,{"$f":"MAX(IF(B31:F31>1,IF(ISNUMBER(B31:F31)=TRUE,B6:F6)))","v":0},{"$f":"COUNTIFS(B6:F6,H6,B31:F31,\"<>1\",B31:F31,\"<>NA\")","v":0},{"$f":"IF(I6>1,\"OUI\",\"NON\")","v":"NON"},"NON"]
["Claudia Custer",{"$f":"'Entreprise A'!G9","v":0},{"$f":"'Entreprise B'!G9","v":0},{"$f":"'Entreprise C'!G9","v":0},{"$f":"'Entreprise D'!G9","v":0},{"$f":"'Entreprise E'!G9","v":0},null,{"$f":"MAX(IF(B32:F32>1,IF(ISNUMBER(B32:F32)=TRUE,B7:F7)))","v":0},{"$f":"COUNTIFS(B7:F7,H7,B32:F32,\"<>1\",B32:F32,\"<>NA\")","v":0},{"$f":"IF(I7>1,\"OUI\",\"NON\")","v":"NON"},"NON"]
["Dieter Diem",{"$f":"'Entreprise A'!G10","v":0},{"$f":"'Entreprise B'!G10","v":0},{"$f":"'Entreprise C'!G10","v":0},{"$f":"'Entreprise D'!G10","v":0},{"$f":"'Entreprise E'!G10","v":0},null,{"$f":"MAX(IF(B33:F33>1,IF(ISNUMBER(B33:F33)=TRUE,B8:F8)))","v":0},{"$f":"COUNTIFS(B8:F8,H8,B33:F33,\"<>1\",B33:F33,\"<>NA\")","v":0},{"$f":"IF(I8>1,\"OUI\",\"NON\")","v":"NON"},"NON"]
["Cadre dirigeant/-e normal/-e",{"$f":"'Entreprise A'!G11","v":300000},{"$f":"'Entreprise B'!G11","v":300000},{"$f":"'Entreprise C'!G11","v":300000},{"$f":"'Entreprise D'!G11","v":300000},{"$f":"'Entreprise E'!G11","v":300000},null,{"$f":"IF(K9=0,\"Vous n'avez plus besoin de faire de tirage au sort!\",\"Vous devez procéder à encore un tirage au sort au moins!\")","v":"Vous devez procéder à encore un tirage au sort au moins!"},null,null,{"$f":"IF(OR(J5=\"OUI\",J6=\"OUI\",J7=\"OUI\",J8=\"OUI\"),IF(J5=K5,IF(J6=K6,IF(J7=K7,IF(J8=K8,0,1),1),1),1),0)","v":1}]
[]
{"$rows_left_out":33}
{"sheet":"4e année","index":10,"n_rows":42,"n_cols":13,"rows_kept":42,"cut":false,"hidden":false,"merged":[[8,7,8,9]]}
["Théorie des jeux - Hauts salaires"]
["Jeu éducatif sur les salaires des dirigeants - Affectation des dirigeants (4e année)"]
[]
["Offres la 4e année","Entreprise A","Entreprise B","Entreprise C","Entreprise D","Entreprise E",null,"Maximum","# Maxima","Tirage au sort"]
["Albert Adam",{"$f":"'Entreprise A'!G14","v":0},{"$f":"'Entreprise B'!G14","v":0},{"$f":"'Entreprise C'!G14","v":0},{"$f":"'Entreprise D'!G14","v":0},{"$f":"'Entreprise E'!G14","v":0},null,{"$f":"MAX(B5:F5)","v":0},{"$f":"COUNTIF(B5:F5,H5)","v":5},{"$f":"IF(I5>1,\"OUI\",\"NON\")","v":"OUI"},"NON"]
["Bertha Binnig",{"$f":"'Entreprise A'!G15","v":0},{"$f":"'Entreprise B'!G15","v":0},{"$f":"'Entreprise C'!G15","v":0},{"$f":"'Entreprise D'!G15","v":0},{"$f":"'Entreprise E'!G15","v":0},null,{"$f":"MAX(IF(B31:F31>1,IF(ISNUMBER(B31:F31)=TRUE,B6:F6)))","v":0},{"$f":"COUNTIFS(B6:F6,H6,B31:F31,\"<>1\",B31:F31,\"<>NA\")","v":0},{"$f":"IF(I6>1,\"OUI\",\"NON\")","v":"NON"},"NON"]
["Claudia Custer",{"$f":"'Entreprise A'!G16","v":0},{"$f":"'Entreprise B'!G16","v":0},{"$f":"'Entreprise C'!G16","v":0},{"$f":"'Entreprise D'!G16","v":0},{"$f":"'Entreprise E'!G16","v":0},null,{"$f":"MAX(IF(B32:F32>1,IF(ISNUMBER(B32:F32)=TRUE,B7:F7)))","v":0},{"$f":"COUNTIFS(B7:F7,H7,B32:F32,\"<>1\",B32:F32,\"<>NA\")","v":0},{"$f":"IF(I7>1,\"OUI\",\"NON\")","v":"NON"},"NON"]
["Dieter Diem",{"$f":"'Entreprise A'!G17","v":0},{"$f":"'Entreprise B'!G17","v":0},{"$f":"'Entreprise C'!G17","v":0},{"$f":"'Entreprise D'!G17","v":0},{"$f":"'Entreprise E'!G17","v":0},null,{"$f":"MAX(IF(B33:F33>1,IF(ISNUMBER(B33:F33)=TRUE,B8:F8)))","v":0},{"$f":"COUNTIFS(B8:F8,H8,B33:F33,\"<>1\",B33:F33,\"<>NA\")","v":0},{"$f":"IF(I8>1,\"OUI\",\"NON\")","v":"NON"},"NON"]
["Cadre dirigeant/-e normal/-e",{"$f":"'Entreprise A'!G18","v":300000},{"$f":"'Entreprise B'!G18","v":300000},{"$f":"'Entreprise C'!G18","v":300000},{"$f":"'Entreprise D'!G18","v":300000},{"$f":"'Entreprise E'!G18","v":300000},null,{"$f":"IF(K9=0,\"Vous n'avez plus besoin de faire de tirage au sort!\",\"Vous devez procéder à encore un tirage au sort au moins!\")","v":"Vous devez procéder à encore un tirage au sort au moins!"},null,null,{"$f":"IF(OR(J5=\"OUI\",J6=\"OUI\",J7=\"OUI\",J8=\"OUI\"),IF(J5=K5,IF(J6=K6,IF(J7=K7,IF(J8=K8,0,1),1),1),1),0)","v":1}]
[]
{"$rows_left_out":33}
{"sheet":"Évaluation des salaires des dir","index":11,"n_rows":9,"n_cols":8,"rows_kept":9,"cut":false,"hidden":false,"merged":[]}
["Théorie des jeux - Hauts salaires"]
["Jeu éducatif sur les salaires des dirigeants - Evaluation du salaire annuel des dirigeants"]
[]
["CEO","1re année","2e année","3e année","4e année"]
["Albert Adam",{"$f":"INDEX('1re année'!$J$38:$J$42,MATCH(A5,'1re année'!$H$38:$H$42,0))","v":0},{"$f":"INDEX('2e année'!$J$38:$J$42,MATCH(A5,'2e année'!$H$38:$H$42,0))","v":0},{"$f":"INDEX('3e année'!$J$38:$J$42,MATCH(A5,'3e année'!$H$38:$H$42,0))","v":0},{"$f":"INDEX('4e année'!$J$38:$J$42,MATCH(A5,'4e année'!$H$38:$H$42,0))","v":0}]
["Bertha Binnig",{"$f":"INDEX('1re année'!$J$38:$J$42,MATCH(A6,'1re année'!$H$38:$H$42,0))","v":{"$error":"#N/A"}},{"$f":"INDEX('2e année'!$J$38:$J$42,MATCH(A6,'2e année'!$H$38:$H$42,0))","v":{"$error":"#N/A"}},{"$f":"INDEX('3e année'!$J$38:$J$42,MATCH(A6,'3e année'!$H$38:$H$42,0))","v":{"$error":"#N/A"}},{"$f":"INDEX('4e année'!$J$38:$J$42,MATCH(A6,'4e année'!$H$38:$H$42,0))","v":{"$error":"#N/A"}}]
["Claudia Custer",{"$f":"INDEX('1re année'!$J$38:$J$42,MATCH(A7,'1re année'!$H$38:$H$42,0))","v":{"$error":"#N/A"}},{"$f":"INDEX('2e année'!$J$38:$J$42,MATCH(A7,'2e année'!$H$38:$H$42,0))","v":{"$error":"#N/A"}},{"$f":"INDEX('3e année'!$J$38:$J$42,MATCH(A7,'3e année'!$H$38:$H$42,0))","v":{"$error":"#N/A"}},{"$f":"INDEX('4e année'!$J$38:$J$42,MATCH(A7,'4e année'!$H$38:$H$42,0))","v":{"$error":"#N/A"}}]
["Dieter Diem",{"$f":"INDEX('1re année'!$J$38:$J$42,MATCH(A8,'1re année'!$H$38:$H$42,0))","v":{"$error":"#N/A"}},{"$f":"INDEX('2e année'!$J$38:$J$42,MATCH(A8,'2e année'!$H$38:$H$42,0))","v":{"$error":"#N/A"}},{"$f":"INDEX('3e année'!$J$38:$J$42,MATCH(A8,'3e année'!$H$38:$H$42,0))","v":{"$error":"#N/A"}},{"$f":"INDEX('4e année'!$J$38:$J$42,MATCH(A8,'4e année'!$H$38:$H$42,0))","v":{"$error":"#N/A"}}]
["Cadre dirigeant/-e normal/-e",{"$f":"INDEX('1re année'!$J$38:$J$42,MATCH(A9,'1re année'!$H$38:$H$42,0))","v":{"$error":"#N/A"}},{"$f":"INDEX('2e année'!$J$38:$J$42,MATCH(A9,'2e année'!$H$38:$H$42,0))","v":{"$error":"#N/A"}},{"$f":"INDEX('3e année'!$J$38:$J$42,MATCH(A9,'3e année'!$H$38:$H$42,0))","v":{"$error":"#N/A"}},{"$f":"INDEX('4e année'!$J$38:$J$42,MATCH(A9,'4e année'!$H$38:$H$42,0))","v":{"$error":"#N/A"}},null,null,"Passer à l’évaluation des entreprises"]

{"sheet":"Évaluation des entreprises","index":12,"n_rows":34,"n_cols":11,"rows_kept":34,"cut":false,"hidden":false,"merged":[[3,1,5,1],[3,7,5,7],[3,6,5,6],[3,5,5,5],[3,4,5,4],[3,3,5,3],[3,2,5,2]]}
["Théorie des jeux - Hauts salaires"]
["Jeu éducatif sur les salaires des dirigeants - Evaluation des entreprises"]
[]
[null,"Se reporter aux données de base","Se reporter à l’année correspondante","Se reporter aux données de base","Rendements des capitaux (bruts, en %) * Capitalisation","Se reporter à l’année correspondante","Bénéfices (bruts, en CHF) - salaire annuel (en CHF)","Bénéfices (nets, en CHF) / capitalisation",null,null,"Retour à l’entreprise A"]
[]
[null,null,null,null,null,null,null,null,null,null,"Passer aux graphiques"]
[]
["1re année","Capitalisation","CEO","Rendements bruts des capitaux, en %","Bénéfices bruts, en CHF","Salaire annuel, en CHF","Bénéfices nets, en CHF","Rendements nets des capitaux, en %"]
["Entreprise A",{"$f":"INDEX('Données de base'!$B$14:$B$18,MATCH(A9,'Données de base'!$A$14:$A$18,0))","v":5000000},{"$f":"INDEX('1re année'!$H$38:$H$42,MATCH('Évaluation des entreprises'!A9,'1re année'!$I$38:$I$42,0))","v":"Albert Adam"},{"$f":"INDEX('Données de base'!$B$6:$B$10,MATCH(C9,'Données de base'!$A$6:$A$10,0))","v":0.14000000000000001},{"$f":"D9*B9","v":700000.00000000012},{"$f":"INDEX('1re année'!$J$38:$J$42,MATCH('Évaluation des entreprises'!A9,'1re année'!$I$38:$I$42,0))","v":0},{"$f":"E9-F9","v":700000.00000000012},{"$f":"G9/B9","v":0.14000000000000001}]
["Entreprise B",{"$f":"INDEX('Données de base'!$B$14:$B$18,MATCH(A10,'Données de base'!$A$14:$A$18,0))","v":10000000},{"$f":"INDEX('1re année'!$H$38:$H$42,MATCH('Évaluation des entreprises'!A10,'1re année'!$I$38:$I$42,0))","v":{"$error":"#N/A"}},{"$f":"INDEX('Données de base'!$B$6:$B$10,MATCH(C10,'Données de base'!$A$6:$A$10,0))","v":{"$error":"#N/A"}},{"$f":"D10*B10","v":{"$error":"#N/A"}},{"$f":"INDEX('1re année'!$J$38:$J$42,MATCH('Évaluation des entreprises'!A10,'1re année'!$I$38:$I$42,0))","v":{"$error":"#N/A"}},{"$f":"E10-F10","v":{"$error":"#N/A"}},{"$f":"G10/B10","v":{"$error":"#N/A"}}]
{"$rows_left_out":25}
{"sheet":"Graphiques","index":13,"n_rows":2,"n_cols":1,"rows_kept":2,"cut":false,"hidden":false,"merged":[]}
["Théorie des jeux - Hauts salaires"]
["Jeu éducatif sur les salaires des dirigeants - Graphiques"]

{"sheet":"Propositions de solutions","index":14,"n_rows":35,"n_cols":8,"rows_kept":35,"cut":false,"hidden":false,"merged":[[13,1,14,1],[13,0,14,0],[21,1,21,5],[3,7,4,7],[3,1,4,1],[3,2,4,2],[3,3,4,3],[3,4,4,4],[3,5,4,5],[3,6,4,6]]}
["Théorie des jeux - Hauts salaires"]
["Jeu éducatif sur les salaires des dirigeants - Propositions de solutions (cf. Exercice 2 du set d’exercices)"]
[]
[null,"Se reporter aux données de base","Se reporter à la solution ci-dessous","Se reporter aux données de base","Rendements des capitaux (bruts, en %) * Capitalisation","Se reporter à la solution ci-dessous","Bénéfices (bruts, en CHF) - salaire annuel (en CHF)","Bénéfices (nets, en CHF) / capitalisation"]
[]
[]
[null,"Capitalisation","CEO","Rendements bruts des capitaux, en %","Bénéfices bruts, en CHF","Salaire annuel, en CHF","Bénéfices nets, en CHF","Rendements nets des capitaux, en %"]
["Entreprise A",{"$f":"INDEX('Données de base'!$B$14:$B$18,MATCH(A8,'Données de base'!$A$14:$A$18,0))","v":5000000},"Cadre dirigeant/-e normal/-e ",0.1,{"$f":"D8*B8","v":500000},300000,{"$f":"E8-F8","v":200000},{"$f":"G8/B8","v":0.04}]
["Entreprise B",{"$f":"INDEX('Données de base'!$B$14:$B$18,MATCH(A9,'Données de base'!$A$14:$A$18,0))","v":10000000},"Dieter Dim ",0.11,{"$f":"D9*B9","v":1100000},{"$f":"C24","v":350000},{"$f":"E9-F9","v":750000},{"$f":"G9/B9","v":7.4999999999999997E-2}]
["Entreprise C",{"$f":"INDEX('Données de base'!$B$14:$B$18,MATCH(A10,'Données de base'!$A$14:$A$18,0))","v":30000000},"Claudia Custer ",0.12,{"$f":"D10*B10","v":3600000},{"$f":"D25","v":500000},{"$f":"E10-F10","v":3100000},{"$f":"G10/B10","v":0.10333333333333333}]
{"$rows_left_out":25}