{"text_format":"1","workbook":"xlsx","n_sheets":15,"sheets":["Instructions","Données de base","Entreprise A","Entreprise B","Entreprise C","Entreprise D","Entreprise E","1re année","2e année","3e année","4e année","Évaluation des salaires des dir","Évaluation des entreprises","Graphiques","Propositions de solutions"],"not_rendered":{"charts":6,"images":9,"macros":1,"external_links":0,"defined_names":0,"comments":0,"pivot_tables":0},"unopened":[],"bounds":{"document_bytes":16777216,"sheet_cells":100000,"rows_first":2000,"rows_last":500,"rows_between":2000,"halvings":0,"cell_chars":16384,"cell_head_chars":4096},"cells_cut":0,"cells_raw":0,"read":"whole","date_system":"1900"}

{"sheet":"Instructions","index":0,"n_rows":91,"n_cols":2,"rows_kept":91,"cut":false,"hidden":false,"merged":[[3,8,5,10],[7,0,8,8],[3,0,5,7],[29,1,33,7],[44,1,51,7],[10,0,23,7],[25,0,27,7],[35,1,38,7],[39,1,42,7],[90,0,91,7],[53,1,60,7],[62,1,70,7],[87,0,88,7],[83,0,85,7],[72,0,75,7],[77,0,81,7]]}
["Théorie des jeux - Hauts salaires"]
["Instructions pour l’évaluation du jeu éducatif sur les salaires des dirigeants"]
[]
["Remarque: Les règles du jeu se trouvent dans le document «Règles du jeu sur les salaires des dirigeants». Nous nous contentons d’expliquer ici les différentes étapes de l’évaluation du jeu. Les données de base du jeu se trouvent à l’onglet «Données de base»."]
[]
[]
[]
["Si vous avez déjà joué une première partie, vous devez remettre le jeu à zéro:"]
[]
[]
["1re étape: Après concertation au sein des groupes, l’enseignant (ou les élèves eux-mêmes) indique, pour la 1re année, l’offre maximale de l’entreprise considérée pour chacun des quatre dirigeants du «Formulaire pour les élèves» à l’onglet correspondant de chaque entreprise (Entreprise A à E). Commencez par l’entreprise A et passez à l’entreprise suivante en cliquant sur le bouton vert."]
[]
[]
[]
[]
[]
[]
[]
[]
[]
[]
[]
[]
[]
[]
["2e étape: Après avoir indiqué l’offre pour la 1re année pour toutes les entreprises, vous vous trouvez à l’onglet de l’entreprise E et pouvez alors procéder à l’affectation des dirigeants/-es (pour la 1re année) en cliquant sur le bouton vert correspondant. "]
[]
[]
[]
[null,"a) Toutes les offres des entreprises A à E ont été automatiquement reportées dans le premier tableau «Offres». L’offre maximale respective est déterminée pour chacune des dirigeantes et chacun des dirigeants, en commençant par celui qui génère les bénéfices bruts les plus élevés (Albert Adam). Si l’entreprise a engagé un dirigeant ou une dirigeante, elle n’est plus en lice pour les dirigeants suivants (moins bons). Ceci est mis en évidence par le fait que les offres sont alors barrées. Si aucune des cellules n’est surlignée en rouge, vous pouvez passer les trois points suivants (b,c et d)."]
[]
[]
[]
[]
[]
[null,"b) Si plusieurs maxima sont identiques, les cellules sont alors surlignées en rouge. Conformément aux règles du jeu, il faut alors procéder à un tirage au sort. Cliquez alors sur les tirages au sort nécessaires. Un chiffre aléatoire entre 0 et 1 est alors attribué aux entreprises ayant émis la même offre. Est gagnante l’entreprise qui obtient le chiffre le plus élevé."]
[]
[]
[]
[null,"Exemple: Dans le cas présent, vous devez commencer par un tirage au sort pour Claudia Custer puis un pour Dieter Diem. Si vous devez procéder à plusieurs tirage au sort, commencez toujours par celui pour la dirigeante ou le dirigeant qui génère les bénéfices bruts les plus élevés (Albert Adam > Bertha Binnig > Claudia Custer > Dieter Diem)."]
[]
[]
[]
[]
[null,"c) Dans le tableau Chiffres aléatoires, les chiffres obtenus par tirage au sort sont surlignés en jaune."]
[]
[]
[]
[]
[]
[]
[]
[]
[null,"d) Lorsque tous les tirages au sort ont été effectués, cela est indiqué en conséquence."]
[]
[]
[]
[]
[]
[]
[]
[]
[null,"e) Dans les tableaux «Classement» et «Offres», l’offre la plus élevée est surlignée en vert.\n\nf) Le tableau «Affectation» en bas à droite résume les entreprises les plus offrantes et les offres correspondantes.\n\ng) Pour procéder à l’évaluation correspondante, cliquez de nouveau sur le bouton vert."]
[]
[]
[]
[]
[]
[]
[]
[]
[]
["3e étape: Les salaires les plus élevés des dirigeants par manche sont résumés à l’onglet «Evaluation des salaires des dirigeants»."]
[]
[]
[]
[]
["4e étape: Les bénéfices nets et bruts correspondants pour chacune des entreprises ainsi que les rendements des capitaux sont calculés automatiquement et affichés à l’onglet «Evaluation des entreprises». Cet onglet sert donc de proposition de solution pour le tableau de la page 2 du «Formulaire pour les élèves»."]
[]
[]
[]
[]
[]
["5e étape: Répétez ces opérations (étapes 1 à 4) jusqu’à ce que les 4 périodes (années) aient été jouées. Comme cela est indiqué dans les règles du jeu, les données de base et, particulièrement, le capital n’évoluent pas pendant le jeu, c’est-à-dire que les bénéfices sont intégralement distribués à la fin de chaque année."]
[]
[]
[]
["6e étape: Les résultats, toutes années confondues, sont représentés schématiquement à l’onglet «Graphiques». Ces graphiques peuvent servir de base pour une discussion finale."]
[]
[]
["Remarque: La solution optimale d’après la théorie des jeux est présentée à l’onglet de la propositions de solutions (cf. Exercice 2 du set d’exercices)."]

{"sheet":"Données de base","index":1,"n_rows":18,"n_cols":3,"rows_kept":18,"cut":false,"hidden":false,"merged":[[3,0,3,2],[11,0,11,2],[12,1,12,2],[17,1,17,2],[16,1,16,2],[15,1,15,2],[14,1,14,2],[13,1,13,2]]}
["Théorie des jeux - Hauts salaires"]
["Données de base du jeu éducatif sur les salaires des dirigeants"]
[]
["Marché des dirigeants"]
["Dirigeants","Bénéfices bruts (en % du capital de l’entreprise) ","Salaire annuel"]
["Albert Adam",0.14000000000000001,"à négocier"]
["Bertha Binnig",0.13,"à négocier"]
["Claudia Custer",0.12,"à négocier"]
["Dieter Diem",0.11,"à négocier"]
["Cadre dirigeant/-e normal/-e",0.1,300000]
[]
["Capitalisation des entreprises"]
["Entreprise","Capitalisation"]
["Entreprise A",5000000]
["Entreprise B",10000000]
["Entreprise C",30000000]
["Entreprise D",400000000]
["Entreprise E",7000000000]

{"sheet":"Entreprise A","index":2,"n_rows":22,"n_cols":7,"rows_kept":22,"cut":false,"hidden":false,"merged":[]}
["Théorie des jeux - Hauts salaires"]
["Jeu éducatif sur les salaires des dirigeants - Offres de l’entreprise A"]
[]
["Capitalisation:",{"$f":"'Données de base'!B14","v":5000000}]
[]
["1re année","Dirigeant-e","Salaire annuel",null,"3e année","Dirigeant-e","Salaire annuel"]
[null,"Albert Adam",null,null,null,"Albert Adam"]
[null,"Bertha Binnig",null,null,null,"Bertha Binnig"]
[null,"Claudia Custer",null,null,null,"Claudia Custer"]
[null,"Dieter Diem",null,null,null,"Dieter Diem"]
[null,"Cadre dirigeant/-e normal/-e",{"$f":"'Données de base'!C10","v":300000},null,null,"Cadre dirigeant/-e normal/-e",{"$f":"'Données de base'!C10","v":300000}]
[]
[" 2e année","Dirigeant-e","Salaire annuel",null,"4e année","Dirigeant-e","Salaire annuel"]
[null,"Albert Adam",null,null,null,"Albert Adam"]
[null,"Bertha Binnig",null,null,null,"Bertha Binnig"]
[null,"Claudia Custer",null,null,null,"Claudia Custer"]
[null,"Dieter Diem",null,null,null,"Dieter Diem"]
[null,"Cadre dirigeant/-e normal/-e",{"$f":"'Données de base'!C10","v":300000},null,null,"Cadre dirigeant/-e normal/-e",{"$f":"'Données de base'!C10","v":300000}]
[]
[]
[]
[null,"Retour au mode d’emploi",null,null,null,"Passer à l’entreprise B"]

{"sheet":"Entreprise B","index":3,"n_rows":22,"n_cols":7,"rows_kept":22,"cut":false,"hidden":false,"merged":[]}
["Théorie des jeux - Hauts salaires"]
["Jeu éducatif sur les salaires des dirigeants - Offres de l’entreprise B"]
[]
["Capitalisation:",{"$f":"'Données de base'!B15","v":10000000}]
[]
["1re année","Dirigeant-e","Salaire annuel",null,"3e année","Dirigeant-e","Salaire annuel"]
[null,"Albert Adam",null,null,null,"Albert Adam"]
[null,"Bertha Binnig",null,null,null,"Bertha Binnig"]
[null,"Claudia Custer",null,null,null,"Claudia Custer"]
[null,"Dieter Diem",null,null,null,"Dieter Diem"]
[null,"Cadre dirigeant/-e normal/-e",{"$f":"'Données de base'!C10","v":300000},null,null,"Cadre dirigeant/-e normal/-e",{"$f":"'Données de base'!C10","v":300000}]
[]
[" 2e année","Dirigeant-e","Salaire annuel",null,"4e année","Dirigeant-e","Salaire annuel"]
[null,"Albert Adam",null,null,null,"Albert Adam"]
[null,"Bertha Binnig",null,null,null,"Bertha Binnig"]
[null,"Claudia Custer",null,null,null,"Claudia Custer"]
[null,"Dieter Diem",null,null,null,"Dieter Diem"]
[null,"Cadre dirigeant/-e normal/-e",{"$f":"'Données de base'!C10","v":300000},null,null,"Cadre dirigeant/-e normal/-e",{"$f":"'Données de base'!C10","v":300000}]
[]
[]
[]
[null,"Retour au mode d’emploi",null,null,null,"Passer à l’entreprise C"]

{"sheet":"Entreprise C","index":4,"n_rows":22,"n_cols":7,"rows_kept":22,"cut":false,"hidden":false,"merged":[]}
["Théorie des jeux - Hauts salaires"]
["Jeu éducatif sur les salaires des dirigeants - Offres de l’entreprise C"]
[]
["Capitalisation:",{"$f":"'Données de base'!B16","v":30000000}]
[]
["1re année","Dirigeant-e","Salaire annuel",null,"3e année","Dirigeant-e","Salaire annuel"]
[null,"Albert Adam",null,null,null,"Albert Adam"]
[null,"Bertha Binnig",null,null,null,"Bertha Binnig"]
[null,"Claudia Custer",null,null,null,"Claudia Custer"]
[null,"Dieter Diem",null,null,null,"Dieter Diem"]
[null,"Cadre dirigeant/-e normal/-e",{"$f":"'Données de base'!C10","v":300000},null,null,"Cadre dirigeant/-e normal/-e",{"$f":"'Données de base'!C10","v":300000}]
[]
[" 2e année","Dirigeant-e","Salaire annuel",null,"4e année","Dirigeant-e","Salaire annuel"]
[null,"Albert Adam",null,null,null,"Albert Adam"]
[null,"Bertha Binnig",null,null,null,"Bertha Binnig"]
[null,"Claudia Custer",null,null,null,"Claudia Custer"]
[null,"Dieter Diem",null,null,null,"Dieter Diem"]
[null,"Cadre dirigeant/-e normal/-e",{"$f":"'Données de base'!C10","v":300000},null,null,"Cadre dirigeant/-e normal/-e",{"$f":"'Données de base'!C10","v":300000}]
[]
[]
[]
[null,"Retour au mode d’emploi",null,null,null,"Passer à l’entreprise D"]

{"sheet":"Entreprise D","index":5,"n_rows":22,"n_cols":7,"rows_kept":22,"cut":false,"hidden":false,"merged":[]}
["Théorie des jeux - Hauts salaires"]
["Jeu éducatif sur les salaires des dirigeants - Offres de l’entreprise D"]
[]
["Capitalisation:",{"$f":"'Données de base'!B17","v":400000000}]
[]
["1re année","Dirigeant-e","Salaire annuel",null,"3e année","Dirigeant-e","Salaire annuel"]
[null,"Albert Adam",null,null,null,"Albert Adam"]
[null,"Bertha Binnig",null,null,null,"Bertha Binnig"]
[null,"Claudia Custer",null,null,null,"Claudia Custer"]
[null,"Dieter Diem",null,null,null,"Dieter Diem"]
[null,"Cadre dirigeant/-e normal/-e",{"$f":"'Données de base'!C10","v":300000},null,null,"Cadre dirigeant/-e normal/-e",{"$f":"'Données de base'!C10","v":300000}]
[]
[" 2e année","Dirigeant-e","Salaire annuel",null,"4e année","Dirigeant-e","Salaire annuel"]
[null,"Albert Adam",null,null,null,"Albert Adam"]
[null,"Bertha Binnig",null,null,null,"Bertha Binnig"]
[null,"Claudia Custer",null,null,null,"Claudia Custer"]
[null,"Dieter Diem",null,null,null,"Dieter Diem"]
[null,"Cadre dirigeant/-e normal/-e",{"$f":"'Données de base'!C10","v":300000},null,null,"Cadre dirigeant/-e normal/-e",{"$f":"'Données de base'!C10","v":300000}]
[]
[]
[]
[null,"Retour au mode d’emploi",null,null,null,"Passer à l’entreprise E"]

{"sheet":"Entreprise E","index":6,"n_rows":28,"n_cols":7,"rows_kept":28,"cut":false,"hidden":false,"merged":[]}
["Théorie des jeux - Hauts salaires"]
["Jeu éducatif sur les salaires des dirigeants - Offres de l’entreprise E"]
[]
["Capitalisation:",{"$f":"'Données de base'!B18","v":7000000000}]
[]
["1re année","Dirigeant-e","Salaire annuel",null,"3e année","Dirigeant-e","Salaire annuel"]
[null,"Albert Adam",null,null,null,"Albert Adam"]
[null,"Bertha Binnig",null,null,null,"Bertha Binnig"]
[null,"Claudia Custer",null,null,null,"Claudia Custer"]
[null,"Dieter Diem",null,null,null,"Dieter Diem"]
[null,"Cadre dirigeant/-e normal/-e",{"$f":"'Données de base'!C10","v":300000},null,null,"Cadre dirigeant/-e normal/-e",{"$f":"'Données de base'!C10","v":300000}]
[]
[" 2e année","Dirigeant-e","Salaire annuel",null,"4e année","Dirigeant-e","Salaire annuel"]
[null,"Albert Adam",null,null,null,"Albert Adam"]
[null,"Bertha Binnig",null,null,null,"Bertha Binnig"]
[null,"Claudia Custer",null,null,null,"Claudia Custer"]
[null,"Dieter Diem",null,null,null,"Dieter Diem"]
[null,"Cadre dirigeant/-e normal/-e",{"$f":"'Données de base'!C10","v":300000},null,null,"Cadre dirigeant/-e normal/-e",{"$f":"'Données de base'!C10","v":300000}]
[]
[]
[]
[null,"Retour au mode d’emploi",null,null,null,"Aller à l’affectation des dirigeants pour la 1re année"]
[]
[null,null,null,null,null,"Aller à l’affectation des dirigeants pour la 2e année"]
[]
[null,null,null,null,null,"Aller à l’affectation des dirigeants pour la 3e année"]
[]
[null,null,null,null,null,"Aller à l’affectation des dirigeants pour la 4e année"]

{"sheet":"1re année","index":7,"n_rows":42,"n_cols":13,"rows_kept":42,"cut":false,"hidden":false,"merged":[[8,7,8,9]]}
["Théorie des jeux - Hauts salaires"]
["Jeu éducatif sur les salaires des dirigeants - Affectation des dirigeants (1re année)"]
[]
["Offres la 1re année","Entreprise A","Entreprise B","Entreprise C","Entreprise D","Entreprise E",null,"Maximum","# Maxima","Tirage au sort "]
["Albert Adam",{"$f":"'Entreprise A'!C7","v":0},{"$f":"'Entreprise B'!C7","v":0},{"$f":"'Entreprise C'!C7","v":0},{"$f":"'Entreprise D'!C7","v":0},{"$f":"'Entreprise E'!C7","v":0},null,{"$f":"MAX(B5:F5)","v":0},{"$f":"COUNTIF(B5:F5,H5)","v":5},{"$f":"IF(I5>1,\"OUI\",\"NON\")","v":"OUI"},"NON"]
["Bertha Binnig",{"$f":"'Entreprise A'!C8","v":0},{"$f":"'Entreprise B'!C8","v":0},{"$f":"'Entreprise C'!C8","v":0},{"$f":"'Entreprise D'!C8","v":0},{"$f":"'Entreprise E'!C8","v":0},null,{"$f":"MAX(IF(B31:F31>1,IF(ISNUMBER(B31:F31)=TRUE,B6:F6)))","v":0},{"$f":"COUNTIFS(B6:F6,H6,B31:F31,\"<>1\",B31:F31,\"<>NA\")","v":0},{"$f":"IF(I6>1,\"OUI\",\"NON\")","v":"NON"},"NON"]
["Claudia Custer",{"$f":"'Entreprise A'!C9","v":0},{"$f":"'Entreprise B'!C9","v":0},{"$f":"'Entreprise C'!C9","v":0},{"$f":"'Entreprise D'!C9","v":0},{"$f":"'Entreprise E'!C9","v":0},null,{"$f":"MAX(IF(B32:F32>1,IF(ISNUMBER(B32:F32)=TRUE,B7:F7)))","v":0},{"$f":"COUNTIFS(B7:F7,H7,B32:F32,\"<>1\",B32:F32,\"<>NA\")","v":0},{"$f":"IF(I7>1,\"OUI\",\"NON\")","v":"NON"},"NON"]
["Dieter Diem",{"$f":"'Entreprise A'!C10","v":0},{"$f":"'Entreprise B'!C10","v":0},{"$f":"'Entreprise C'!C10","v":0},{"$f":"'Entreprise D'!C10","v":0},{"$f":"'Entreprise E'!C10","v":0},null,{"$f":"MAX(IF(B33:F33>1,IF(ISNUMBER(B33:F33)=TRUE,B8:F8)))","v":0},{"$f":"COUNTIFS(B8:F8,H8,B33:F33,\"<>1\",B33:F33,\"<>NA\")","v":0},{"$f":"IF(I8>1,\"OUI\",\"NON\")","v":"NON"},"NON"]
["Cadre dirigeant/-e normal/-e",{"$f":"'Entreprise A'!C11","v":300000},{"$f":"'Entreprise B'!C11","v":300000},{"$f":"'Entreprise C'!C11","v":300000},{"$f":"'Entreprise D'!C11","v":300000},{"$f":"'Entreprise E'!C11","v":300000},null,{"$f":"IF(K9=0,\"Vous n'avez pas / plus besoin de faire de tirage au sort!\",\"Vous devez procéder à encore un tirage au sort au moins!\")","v":"Vous devez procéder à encore un tirage au sort au moins!"},null,null,{"$f":"IF(OR(J5=\"OUI\",J6=\"OUI\",J7=\"OUI\",J8=\"OUI\"),IF(J5=K5,IF(J6=K6,IF(J7=K7,IF(J8=K8,0,1),1),1),1),0)","v":1}]
[]
["Zufallszahlen im 1. Jahr","Firma A","Firma B","Firma C","Firma D","Firma E"]
["Albert Adam",{"$f":"IF(AND(B5=$H$5,$I$5>1),RAND(),\"\")","v":0.59959751268568351},{"$f":"IF(AND(C5=$H$5,$I$5>1),RAND(),\"\")","v":0.82098920943502574},{"$f":"IF(AND(D5=$H$5,$I$5>1),RAND(),\"\")","v":0.74571835054584945},{"$f":"IF(AND(E5=$H$5,$I$5>1),RAND(),\"\")","v":0.78442056586757758},{"$f":"IF(AND(F5=$H$5,$I$5>1),RAND(),\"\")","v":0.61485251601904678}]
["Bertha Binnig",{"$f":"IF(AND(B6=$H$6,$I$6>1,B31>1,B31<>\"na\"),RAND(),\"\")","v":""},{"$f":"IF(AND(C6=$H$6,$I$6>1,C31>1,C31<>\"na\"),RAND(),\"\")","v":""},{"$f":"IF(AND(D6=$H$6,$I$6>1,D31>1,D31<>\"na\"),RAND(),\"\")","v":""},{"$f":"IF(AND(E6=$H$6,$I$6>1,E31>1,E31<>\"na\"),RAND(),\"\")","v":""},{"$f":"IF(AND(F6=$H$6,$I$6>1,F31>1,F31<>\"na\"),RAND(),\"\")","v":""}]
["Claudia Custer",{"$f":"IF(AND(B7=$H$7,$I$7>1,B32>1,B32<>\"na\"),RAND(),\"\")","v":""},{"$f":"IF(AND(C7=$H$7,$I$7>1,C32>1,C32<>\"na\"),RAND(),\"\")","v":""},{"$f":"IF(AND(D7=$H$7,$I$7>1,D32>1,D32<>\"na\"),RAND(),\"\")","v":""},{"$f":"IF(AND(E7=$H$7,$I$7>1,E32>1,E32<>\"na\"),RAND(),\"\")","v":""},{"$f":"IF(AND(F7=$H$7,$I$7>1,F32>1,F32<>\"na\"),RAND(),\"\")","v":""}]
["Dieter Diem",{"$f":"IF(AND(B8=$H$8,$I$8>1,B33>1,B33<>\"na\"),RAND(),\"\")","v":""},{"$f":"IF(AND(C8=$H$8,$I$8>1,C33>1,C33<>\"na\"),RAND(),\"\")","v":""},{"$f":"IF(AND(D8=$H$8,$I$8>1,D33>1,D33<>\"na\"),RAND(),\"\")","v":""},{"$f":"IF(AND(E8=$H$8,$I$8>1,E33>1,E33<>\"na\"),RAND(),\"\")","v":""},{"$f":"IF(AND(F8=$H$8,$I$8>1,F33>1,F33<>\"na\"),RAND(),\"\")","v":""}]
[]
["Chiffres aléatoires la 1re année","Entreprise A","Entreprise B","Entreprise C","Entreprise D","Entreprise E"]
["Albert Adam"]
["Bertha Binnig"]
["Claudia Custer"]
["Dieter Diem"]
[]
["Angebote* im 1. Jahr","Firma A","Firma B","Firma C","Firma D","Firma E"]
["Albert Adam",{"$f":"IF(AND($I$5>1,B5=$H$5),B5+1*B18,B5)","v":0},{"$f":"IF(AND($I$5>1,C5=$H$5),C5+1*C18,C5)","v":0},{"$f":"IF(AND($I$5>1,D5=$H$5),D5+1*D18,D5)","v":0},{"$f":"IF(AND($I$5>1,E5=$H$5),E5+1*E18,E5)","v":0},{"$f":"IF(AND($I$5>1,F5=$H$5),F5+1*F18,F5)","v":0}]
["Bertha Binnig",{"$f":"IF(AND($I$6>1,B6=$H$6),B6+1*B19,B6)","v":0},{"$f":"IF(AND($I$6>1,C6=$H$6),C6+1*C19,C6)","v":0},{"$f":"IF(AND($I$6>1,D6=$H$6),D6+1*D19,D6)","v":0},{"$f":"IF(AND($I$6>1,E6=$H$6),E6+1*E19,E6)","v":0},{"$f":"IF(AND($I$6>1,F6=$H$6),F6+1*F19,F6)","v":0}]
["Claudia Custer",{"$f":"IF(AND($I$7>1,B7=$H$7),B7+1*B20,B7)","v":0},{"$f":"IF(AND($I$7>1,C7=$H$7),C7+1*C20,C7)","v":0},{"$f":"IF(AND($I$7>1,D7=$H$7),D7+1*D20,D7)","v":0},{"$f":"IF(AND($I$7>1,E7=$H$7),E7+1*E20,E7)","v":0},{"$f":"IF(AND($I$7>1,F7=$H$7),F7+1*F20,F7)","v":0}]
["Dieter Diem",{"$f":"IF(AND($I$8>1,B8=$H$8),B8+1*B21,B8)","v":0},{"$f":"IF(AND($I$8>1,C8=$H$8),C8+1*C21,C8)","v":0},{"$f":"IF(AND($I$8>1,D8=$H$8),D8+1*D21,D8)","v":0},{"$f":"IF(AND($I$8>1,E8=$H$8),E8+1*E21,E8)","v":0},{"$f":"IF(AND($I$8>1,F8=$H$8),F8+1*F21,F8)","v":0}]
["Normal",{"$f":"B9","v":300000},{"$f":"C9","v":300000},{"$f":"D9","v":300000},{"$f":"E9","v":300000},{"$f":"F9","v":300000}]
[]
["Classement la 1re année","Entreprise A","Entreprise B","Entreprise C","Entreprise D","Entreprise E"]
["Albert Adam",{"$f":"RANK(B24,$B$24:$F$24)","v":1},{"$f":"RANK(C24,$B$24:$F$24)","v":1},{"$f":"RANK(D24,$B$24:$F$24)","v":1},{"$f":"RANK(E24,$B$24:$F$24)","v":1},{"$f":"RANK(F24,$B$24:$F$24)","v":1}]
["Bertha Binnig",{"$f":"IF(AND(B$31>1,B$31<>\"NA\"),COUNTIFS($B$25:$F$25,\">\"&B25,$B$31:$F$31,\">\"&1)+1,\"NA\")","v":"NA"},{"$f":"IF(AND(C$31>1,C$31<>\"NA\"),COUNTIFS($B$25:$F$25,\">\"&C25,$B$31:$F$31,\">\"&1)+1,\"NA\")","v":"NA"},{"$f":"IF(AND(D$31>1,D$31<>\"NA\"),COUNTIFS($B$25:$F$25,\">\"&D25,$B$31:$F$31,\">\"&1)+1,\"NA\")","v":"NA"},{"$f":"IF(AND(E$31>1,E$31<>\"NA\"),COUNTIFS($B$25:$F$25,\">\"&E25,$B$31:$F$31,\">\"&1)+1,\"NA\")","v":"NA"},{"$f":"IF(AND(F$31>1,F$31<>\"NA\"),COUNTIFS($B$25:$F$25,\">\"&F25,$B$31:$F$31,\">\"&1)+1,\"NA\")","v":"NA"}]
["Claudia Custer",{"$f":"IF(AND(B$32>1,B$32<>\"NA\"),COUNTIFS($B$26:$F$26,\">\"&B26,$B$32:$F$32,\">\"&1)+1,\"NA\")","v":"NA"},{"$f":"IF(AND(C$32>1,C$32<>\"NA\"),COUNTIFS($B$26:$F$26,\">\"&C26,$B$32:$F$32,\">\"&1)+1,\"NA\")","v":"NA"},{"$f":"IF(AND(D$32>1,D$32<>\"NA\"),COUNTIFS($B$26:$F$26,\">\"&D26,$B$32:$F$32,\">\"&1)+1,\"NA\")","v":"NA"},{"$f":"IF(AND(E$32>1,E$32<>\"NA\"),COUNTIFS($B$26:$F$26,\">\"&E26,$B$32:$F$32,\">\"&1)+1,\"NA\")","v":"NA"},{"$f":"IF(AND(F$32>1,F$32<>\"NA\"),COUNTIFS($B$26:$F$26,\">\"&F26,$B$32:$F$32,\">\"&1)+1,\"NA\")","v":"NA"}]
["Dieter Diem",{"$f":"IF(AND(B$33>1,B$33<>\"NA\"),COUNTIFS($B$27:$F$27,\">\"&B27,$B$33:$F$33,\">\"&1)+1,\"NA\")","v":"NA"},{"$f":"IF(AND(C$33>1,C$33<>\"NA\"),COUNTIFS($B$27:$F$27,\">\"&C27,$B$33:$F$33,\">\"&1)+1,\"NA\")","v":"NA"},{"$f":"IF(AND(D$33>1,D$33<>\"NA\"),COUNTIFS($B$27:$F$27,\">\"&D27,$B$33:$F$33,\">\"&1)+1,\"NA\")","v":"NA"},{"$f":"IF(AND(E$33>1,E$33<>\"NA\"),COUNTIFS($B$27:$F$27,\">\"&E27,$B$33:$F$33,\">\"&1)+1,\"NA\")","v":"NA"},{"$f":"IF(AND(F$33>1,F$33<>\"NA\"),COUNTIFS($B$27:$F$27,\">\"&F27,$B$33:$F$33,\">\"&1)+1,\"NA\")","v":"NA"}]
["Cadre dirigeant/-e normal/-e",{"$f":"IF(AND(B$34>1,B$34<>\"NA\"),COUNTIFS($B$28:$F$28,\">\"&B28,$B$34:$F$34,\">\"&1)+1,\"NA\")","v":"NA"},{"$f":"IF(AND(C$34>1,C$34<>\"NA\"),COUNTIFS($B$28:$F$28,\">\"&C28,$B$34:$F$34,\">\"&1)+1,\"NA\")","v":"NA"},{"$f":"IF(AND(D$34>1,D$34<>\"NA\"),COUNTIFS($B$28:$F$28,\">\"&D28,$B$34:$F$34,\">\"&1)+1,\"NA\")","v":"NA"},{"$f":"IF(AND(E$34>1,E$34<>\"NA\"),COUNTIFS($B$28:$F$28,\">\"&E28,$B$34:$F$34,\">\"&1)+1,\"NA\")","v":"NA"},{"$f":"IF(AND(F$34>1,F$34<>\"NA\"),COUNTIFS($B$28:$F$28,\">\"&F28,$B$34:$F$34,\">\"&1)+1,\"NA\")","v":"NA"}]
[]
["Offres la 1re année","Entreprise A","Entreprise B","Entreprise C","Entreprise D","Entreprise E",null,"Affectation","Entreprise","Salaire annuel"]
["Albert Adam",{"$f":"B5","v":0},0,0,0,0,null,"Albert Adam",{"$f":"INDEX($B$30:$F$30,MATCH(1,B31:F31,0))","v":"Entreprise A"},{"$f":"INDEX(B5:F5,MATCH(I38,$B$4:$F$4,0))","v":0},null,null,"Retour au mode d’emploi"]
["Bertha Binnig",0,0,0,0,0,null,"Bertha Binnig",{"$f":"INDEX($B$30:$F$30,MATCH(1,B32:F32,0))","v":{"$error":"#N/A"}},{"$f":"INDEX(B6:F6,MATCH(I39,$B$4:$F$4,0))","v":{"$error":"#N/A"}}]
["Claudia Custer",0,0,0,0,0,null,"Claudia Custer",{"$f":"INDEX($B$30:$F$30,MATCH(1,B33:F33,0))","v":{"$error":"#N/A"}},{"$f":"INDEX(B7:F7,MATCH(I40,$B$4:$F$4,0))","v":{"$error":"#N/A"}}]
["Dieter Diem",0,0,0,0,0,null,"Dieter Diem",{"$f":"INDEX($B$30:$F$30,MATCH(1,B34:F34,0))","v":{"$error":"#N/A"}},{"$f":"INDEX(B8:F8,MATCH(I41,$B$4:$F$4,0))","v":{"$error":"#N/A"}}]
["Cadre dirigeant/-e normal/-e",300000,300000,300000,300000,300000,null,"Cadre dirigeant/-e normal/-e",{"$f":"INDEX($B$30:$F$30,MATCH(1,B35:F35,0))","v":{"$error":"#N/A"}},{"$f":"INDEX(B9:F9,MATCH(I42,$B$4:$F$4,0))","v":{"$error":"#N/A"}},null,null,"Passer à l’évaluation des salaires des dirigeants"]

{"sheet":"2e année","index":8,"n_rows":42,"n_cols":13,"rows_kept":42,"cut":false,"hidden":false,"merged":[[8,7,8,9]]}
["Théorie des jeux - Hauts salaires"]
["Jeu éducatif sur les salaires des dirigeants - Affectation des dirigeants (2e année)"]
[]
["Offres la 2e année","Entreprise A","Entreprise B","Entreprise C","Entreprise D","Entreprise E",null,"Maximum","# Maxima","Tirage au sort"]
["Albert Adam",{"$f":"'Entreprise A'!C14","v":0},{"$f":"'Entreprise B'!C14","v":0},{"$f":"'Entreprise C'!C14","v":0},{"$f":"'Entreprise D'!C14","v":0},{"$f":"'Entreprise E'!C14","v":0},null,{"$f":"MAX(B5:F5)","v":0},{"$f":"COUNTIF(B5:F5,H5)","v":5},{"$f":"IF(I5>1,\"OUI\",\"NON\")","v":"OUI"},"NON"]
["Bertha Binnig",{"$f":"'Entreprise A'!C15","v":0},{"$f":"'Entreprise B'!C15","v":0},{"$f":"'Entreprise C'!C15","v":0},{"$f":"'Entreprise D'!C15","v":0},{"$f":"'Entreprise E'!C15","v":0},null,{"$f":"MAX(IF(B31:F31>1,IF(ISNUMBER(B31:F31)=TRUE,B6:F6)))","v":0},{"$f":"COUNTIFS(B6:F6,H6,B31:F31,\"<>1\",B31:F31,\"<>NA\")","v":0},{"$f":"IF(I6>1,\"OUI\",\"NON\")","v":"NON"},"NON"]
["Claudia Custer",{"$f":"'Entreprise A'!C16","v":0},{"$f":"'Entreprise B'!C16","v":0},{"$f":"'Entreprise C'!C16","v":0},{"$f":"'Entreprise D'!C16","v":0},{"$f":"'Entreprise E'!C16","v":0},null,{"$f":"MAX(IF(B32:F32>1,IF(ISNUMBER(B32:F32)=TRUE,B7:F7)))","v":0},{"$f":"COUNTIFS(B7:F7,H7,B32:F32,\"<>1\",B32:F32,\"<>NA\")","v":0},{"$f":"IF(I7>1,\"OUI\",\"NON\")","v":"NON"},"NON"]
["Dieter Diem",{"$f":"'Entreprise A'!C17","v":0},{"$f":"'Entreprise B'!C17","v":0},{"$f":"'Entreprise C'!C17","v":0},{"$f":"'Entreprise D'!C17","v":0},{"$f":"'Entreprise E'!C17","v":0},null,{"$f":"MAX(IF(B33:F33>1,IF(ISNUMBER(B33:F33)=TRUE,B8:F8)))","v":0},{"$f":"COUNTIFS(B8:F8,H8,B33:F33,\"<>1\",B33:F33,\"<>NA\")","v":0},{"$f":"IF(I8>1,\"OUI\",\"NON\")","v":"NON"},"NON"]
["Cadre dirigeant/-e normal/-e",{"$f":"'Entreprise A'!C18","v":300000},{"$f":"'Entreprise B'!C18","v":300000},{"$f":"'Entreprise C'!C18","v":300000},{"$f":"'Entreprise D'!C18","v":300000},{"$f":"'Entreprise E'!C18","v":300000},null,{"$f":"IF(K9=0,\"Vous n'avez pas / plus besoin de faire de tirage au sort!\",\"Vous devez procéder à encore un tirage au sort au moins!\")","v":"Vous devez procéder à encore un tirage au sort au moins!"},null,null,{"$f":"IF(OR(J5=\"OUI\",J6=\"OUI\",J7=\"OUI\",J8=\"OUI\"),IF(J5=K5,IF(J6=K6,IF(J7=K7,IF(J8=K8,0,1),1),1),1),0)","v":1}]
[]
["Zufallszahlen im 2. Jahr","Firma A","Firma B","Firma C","Firma D","Firma E"]
["Albert Adam",{"$f":"IF(AND(B5=$H$5,$I$5>1),RAND(),\"\")","v":0.69595291909621915},{"$f":"IF(AND(C5=$H$5,$I$5>1),RAND(),\"\")","v":0.49550559387547632},{"$f":"IF(AND(D5=$H$5,$I$5>1),RAND(),\"\")","v":0.85053373780889219},{"$f":"IF(AND(E5=$H$5,$I$5>1),RAND(),\"\")","v":0.93296824250527},{"$f":"IF(AND(F5=$H$5,$I$5>1),RAND(),\"\")","v":0.70028753368016383}]
["Bertha Binnig",{"$f":"IF(AND(B6=$H$6,$I$6>1,B31>1,B31<>\"na\"),RAND(),\"\")","v":""},{"$f":"IF(AND(C6=$H$6,$I$6>1,C31>1,C31<>\"na\"),RAND(),\"\")","v":""},{"$f":"IF(AND(D6=$H$6,$I$6>1,D31>1,D31<>\"na\"),RAND(),\"\")","v":""},{"$f":"IF(AND(E6=$H$6,$I$6>1,E31>1,E31<>\"na\"),RAND(),\"\")","v":""},{"$f":"IF(AND(F6=$H$6,$I$6>1,F31>1,F31<>\"na\"),RAND(),\"\")","v":""}]
["Claudia Custer",{"$f":"IF(AND(B7=$H$7,$I$7>1,B32>1,B32<>\"na\"),RAND(),\"\")","v":""},{"$f":"IF(AND(C7=$H$7,$I$7>1,C32>1,C32<>\"na\"),RAND(),\"\")","v":""},{"$f":"IF(AND(D7=$H$7,$I$7>1,D32>1,D32<>\"na\"),RAND(),\"\")","v":""},{"$f":"IF(AND(E7=$H$7,$I$7>1,E32>1,E32<>\"na\"),RAND(),\"\")","v":""},{"$f":"IF(AND(F7=$H$7,$I$7>1,F32>1,F32<>\"na\"),RAND(),\"\")","v":""}]
["Dieter Diem",{"$f":"IF(AND(B8=$H$8,$I$8>1,B33>1,B33<>\"na\"),RAND(),\"\")","v":""},{"$f":"IF(AND(C8=$H$8,$I$8>1,C33>1,C33<>\"na\"),RAND(),\"\")","v":""},{"$f":"IF(AND(D8=$H$8,$I$8>1,D33>1,D33<>\"na\"),RAND(),\"\")","v":""},{"$f":"IF(AND(E8=$H$8,$I$8>1,E33>1,E33<>\"na\"),RAND(),\"\")","v":""},{"$f":"IF(AND(F8=$H$8,$I$8>1,F33>1,F33<>\"na\"),RAND(),\"\")","v":""}]
[]
["Chiffres aléatoires la 2e année","Entreprise A","Entreprise B","Entreprise C","Entreprise D","Entreprise E"]
["Albert Adam"]
["Bertha Binnig"]
["Claudia Custer"]
["Dieter Diem"]
[]
["Angebote* im 2. Jahr","Firma A","Firma B","Firma C","Firma D","Firma E"]
["Albert Adam",{"$f":"IF(AND($I$5>1,B5=$H$5),B5+1*B18,B5)","v":0},{"$f":"IF(AND($I$5>1,C5=$H$5),C5+1*C18,C5)","v":0},{"$f":"IF(AND($I$5>1,D5=$H$5),D5+1*D18,D5)","v":0},{"$f":"IF(AND($I$5>1,E5=$H$5),E5+1*E18,E5)","v":0},{"$f":"IF(AND($I$5>1,F5=$H$5),F5+1*F18,F5)","v":0}]
["Bertha Binnig",{"$f":"IF(AND($I$6>1,B6=$H$6),B6+1*B19,B6)","v":0},{"$f":"IF(AND($I$6>1,C6=$H$6),C6+1*C19,C6)","v":0},{"$f":"IF(AND($I$6>1,D6=$H$6),D6+1*D19,D6)","v":0},{"$f":"IF(AND($I$6>1,E6=$H$6),E6+1*E19,E6)","v":0},{"$f":"IF(AND($I$6>1,F6=$H$6),F6+1*F19,F6)","v":0}]
["Claudia Custer",{"$f":"IF(AND($I$7>1,B7=$H$7),B7+1*B20,B7)","v":0},{"$f":"IF(AND($I$7>1,C7=$H$7),C7+1*C20,C7)","v":0},{"$f":"IF(AND($I$7>1,D7=$H$7),D7+1*D20,D7)","v":0},{"$f":"IF(AND($I$7>1,E7=$H$7),E7+1*E20,E7)","v":0},{"$f":"IF(AND($I$7>1,F7=$H$7),F7+1*F20,F7)","v":0}]
["Dieter Diem",{"$f":"IF(AND($I$8>1,B8=$H$8),B8+1*B21,B8)","v":0},{"$f":"IF(AND($I$8>1,C8=$H$8),C8+1*C21,C8)","v":0},{"$f":"IF(AND($I$8>1,D8=$H$8),D8+1*D21,D8)","v":0},{"$f":"IF(AND($I$8>1,E8=$H$8),E8+1*E21,E8)","v":0},{"$f":"IF(AND($I$8>1,F8=$H$8),F8+1*F21,F8)","v":0}]
["Normal",{"$f":"B9","v":300000},{"$f":"C9","v":300000},{"$f":"D9","v":300000},{"$f":"E9","v":300000},{"$f":"F9","v":300000}]
[]
["Classement la 2e année","Entreprise A","Entreprise B","Entreprise C","Entreprise D","Entreprise E"]
["Albert Adam",{"$f":"RANK(B24,$B$24:$F$24)","v":1},{"$f":"RANK(C24,$B$24:$F$24)","v":1},{"$f":"RANK(D24,$B$24:$F$24)","v":1},{"$f":"RANK(E24,$B$24:$F$24)","v":1},{"$f":"RANK(F24,$B$24:$F$24)","v":1}]
["Bertha Binnig",{"$f":"IF(AND(B$31>1,B$31<>\"NA\"),COUNTIFS($B$25:$F$25,\">\"&B25,$B$31:$F$31,\">\"&1)+1,\"NA\")","v":"NA"},{"$f":"IF(AND(C$31>1,C$31<>\"NA\"),COUNTIFS($B$25:$F$25,\">\"&C25,$B$31:$F$31,\">\"&1)+1,\"NA\")","v":"NA"},{"$f":"IF(AND(D$31>1,D$31<>\"NA\"),COUNTIFS($B$25:$F$25,\">\"&D25,$B$31:$F$31,\">\"&1)+1,\"NA\")","v":"NA"},{"$f":"IF(AND(E$31>1,E$31<>\"NA\"),COUNTIFS($B$25:$F$25,\">\"&E25,$B$31:$F$31,\">\"&1)+1,\"NA\")","v":"NA"},{"$f":"IF(AND(F$31>1,F$31<>\"NA\"),COUNTIFS($B$25:$F$25,\">\"&F25,$B$31:$F$31,\">\"&1)+1,\"NA\")","v":"NA"}]
["Claudia Custer",{"$f":"IF(AND(B$32>1,B$32<>\"NA\"),COUNTIFS($B$26:$F$26,\">\"&B26,$B$32:$F$32,\">\"&1)+1,\"NA\")","v":"NA"},{"$f":"IF(AND(C$32>1,C$32<>\"NA\"),COUNTIFS($B$26:$F$26,\">\"&C26,$B$32:$F$32,\">\"&1)+1,\"NA\")","v":"NA"},{"$f":"IF(AND(D$32>1,D$32<>\"NA\"),COUNTIFS($B$26:$F$26,\">\"&D26,$B$32:$F$32,\">\"&1)+1,\"NA\")","v":"NA"},{"$f":"IF(AND(E$32>1,E$32<>\"NA\"),COUNTIFS($B$26:$F$26,\">\"&E26,$B$32:$F$32,\">\"&1)+1,\"NA\")","v":"NA"},{"$f":"IF(AND(F$32>1,F$32<>\"NA\"),COUNTIFS($B$26:$F$26,\">\"&F26,$B$32:$F$32,\">\"&1)+1,\"NA\")","v":"NA"}]
["Dieter Diem",{"$f":"IF(AND(B$33>1,B$33<>\"NA\"),COUNTIFS($B$27:$F$27,\">\"&B27,$B$33:$F$33,\">\"&1)+1,\"NA\")","v":"NA"},{"$f":"IF(AND(C$33>1,C$33<>\"NA\"),COUNTIFS($B$27:$F$27,\">\"&C27,$B$33:$F$33,\">\"&1)+1,\"NA\")","v":"NA"},{"$f":"IF(AND(D$33>1,D$33<>\"NA\"),COUNTIFS($B$27:$F$27,\">\"&D27,$B$33:$F$33,\">\"&1)+1,\"NA\")","v":"NA"},{"$f":"IF(AND(E$33>1,E$33<>\"NA\"),COUNTIFS($B$27:$F$27,\">\"&E27,$B$33:$F$33,\">\"&1)+1,\"NA\")","v":"NA"},{"$f":"IF(AND(F$33>1,F$33<>\"NA\"),COUNTIFS($B$27:$F$27,\">\"&F27,$B$33:$F$33,\">\"&1)+1,\"NA\")","v":"NA"}]
["Cadre dirigeant/-e normal/-e",{"$f":"IF(AND(B$34>1,B$34<>\"NA\"),COUNTIFS($B$28:$F$28,\">\"&B28,$B$34:$F$34,\">\"&1)+1,\"NA\")","v":"NA"},{"$f":"IF(AND(C$34>1,C$34<>\"NA\"),COUNTIFS($B$28:$F$28,\">\"&C28,$B$34:$F$34,\">\"&1)+1,\"NA\")","v":"NA"},{"$f":"IF(AND(D$34>1,D$34<>\"NA\"),COUNTIFS($B$28:$F$28,\">\"&D28,$B$34:$F$34,\">\"&1)+1,\"NA\")","v":"NA"},{"$f":"IF(AND(E$34>1,E$34<>\"NA\"),COUNTIFS($B$28:$F$28,\">\"&E28,$B$34:$F$34,\">\"&1)+1,\"NA\")","v":"NA"},{"$f":"IF(AND(F$34>1,F$34<>\"NA\"),COUNTIFS($B$28:$F$28,\">\"&F28,$B$34:$F$34,\">\"&1)+1,\"NA\")","v":"NA"}]
[]
["Offres la 2e année","Entreprise A","Entreprise B","Entreprise C","Entreprise D","Entreprise E",null,"Affectation","Entreprise","Salaire annuel"]
["Albert Adam",{"$f":"B5","v":0},0,0,0,0,null,"Albert Adam",{"$f":"INDEX($B$30:$F$30,MATCH(1,B31:F31,0))","v":"Entreprise A"},{"$f":"INDEX(B5:F5,MATCH(I38,$B$4:$F$4,0))","v":0},null,null,"Retour au mode d’emploi"]
["Bertha Binnig",0,0,0,0,0,null,"Bertha Binnig",{"$f":"INDEX($B$30:$F$30,MATCH(1,B32:F32,0))","v":{"$error":"#N/A"}},{"$f":"INDEX(B6:F6,MATCH(I39,$B$4:$F$4,0))","v":{"$error":"#N/A"}}]
["Claudia Custer",0,0,0,0,0,null,"Claudia Custer",{"$f":"INDEX($B$30:$F$30,MATCH(1,B33:F33,0))","v":{"$error":"#N/A"}},{"$f":"INDEX(B7:F7,MATCH(I40,$B$4:$F$4,0))","v":{"$error":"#N/A"}}]
["Dieter Diem",{"$f":"B8","v":0},0,0,0,0,null,"Dieter Diem",{"$f":"INDEX($B$30:$F$30,MATCH(1,B34:F34,0))","v":{"$error":"#N/A"}},{"$f":"INDEX(B8:F8,MATCH(I41,$B$4:$F$4,0))","v":{"$error":"#N/A"}}]
["Cadre dirigeant/-e normal/-e",{"$f":"B9","v":300000},{"$f":"C9","v":300000},{"$f":"D9","v":300000},{"$f":"E9","v":300000},{"$f":"F9","v":300000},null,"Cadre dirigeant/-e normal/-e",{"$f":"INDEX($B$30:$F$30,MATCH(1,B35:F35,0))","v":{"$error":"#N/A"}},{"$f":"INDEX(B9:F9,MATCH(I42,$B$4:$F$4,0))","v":{"$error":"#N/A"}},null,null,"Passer à l’évaluation des salaires des dirigeants"]

{"sheet":"3e année","index":9,"n_rows":42,"n_cols":13,"rows_kept":42,"cut":false,"hidden":false,"merged":[[8,7,8,9]]}
["Théorie des jeux - Hauts salaires"]
["Jeu éducatif sur les salaires des dirigeants - Affectation des dirigeants (3e année)"]
[]
["Offres la 3e année","Entreprise A","Entreprise B","Entreprise C","Entreprise D","Entreprise E",null,"Maximum","# Maxima","Tirage au sort"]
["Albert Adam",{"$f":"'Entreprise A'!G7","v":0},{"$f":"'Entreprise B'!G7","v":0},{"$f":"'Entreprise C'!G7","v":0},{"$f":"'Entreprise D'!G7","v":0},{"$f":"'Entreprise E'!G7","v":0},null,{"$f":"MAX(B5:F5)","v":0},{"$f":"COUNTIF(B5:F5,H5)","v":5},{"$f":"IF(I5>1,\"OUI\",\"NON\")","v":"OUI"},"NON"]
["Bertha Binnig",{"$f":"'Entreprise A'!G8","v":0},{"$f":"'Entreprise B'!G8","v":0},{"$f":"'Entreprise C'!G8","v":0},{"$f":"'Entreprise D'!G8","v":0},{"$f":"'Entreprise E'!G8","v":0},null,{"$f":"MAX(IF(B31:F31>1,IF(ISNUMBER(B31:F31)=TRUE,B6:F6)))","v":0},{"$f":"COUNTIFS(B6:F6,H6,B31:F31,\"<>1\",B31:F31,\"<>NA\")","v":0},{"$f":"IF(I6>1,\"OUI\",\"NON\")","v":"NON"},"NON"]
["Claudia Custer",{"$f":"'Entreprise A'!G9","v":0},{"$f":"'Entreprise B'!G9","v":0},{"$f":"'Entreprise C'!G9","v":0},{"$f":"'Entreprise D'!G9","v":0},{"$f":"'Entreprise E'!G9","v":0},null,{"$f":"MAX(IF(B32:F32>1,IF(ISNUMBER(B32:F32)=TRUE,B7:F7)))","v":0},{"$f":"COUNTIFS(B7:F7,H7,B32:F32,\"<>1\",B32:F32,\"<>NA\")","v":0},{"$f":"IF(I7>1,\"OUI\",\"NON\")","v":"NON"},"NON"]
["Dieter Diem",{"$f":"'Entreprise A'!G10","v":0},{"$f":"'Entreprise B'!G10","v":0},{"$f":"'Entreprise C'!G10","v":0},{"$f":"'Entreprise D'!G10","v":0},{"$f":"'Entreprise E'!G10","v":0},null,{"$f":"MAX(IF(B33:F33>1,IF(ISNUMBER(B33:F33)=TRUE,B8:F8)))","v":0},{"$f":"COUNTIFS(B8:F8,H8,B33:F33,\"<>1\",B33:F33,\"<>NA\")","v":0},{"$f":"IF(I8>1,\"OUI\",\"NON\")","v":"NON"},"NON"]
["Cadre dirigeant/-e normal/-e",{"$f":"'Entreprise A'!G11","v":300000},{"$f":"'Entreprise B'!G11","v":300000},{"$f":"'Entreprise C'!G11","v":300000},{"$f":"'Entreprise D'!G11","v":300000},{"$f":"'Entreprise E'!G11","v":300000},null,{"$f":"IF(K9=0,\"Vous n'avez plus besoin de faire de tirage au sort!\",\"Vous devez procéder à encore un tirage au sort au moins!\")","v":"Vous devez procéder à encore un tirage au sort au moins!"},null,null,{"$f":"IF(OR(J5=\"OUI\",J6=\"OUI\",J7=\"OUI\",J8=\"OUI\"),IF(J5=K5,IF(J6=K6,IF(J7=K7,IF(J8=K8,0,1),1),1),1),0)","v":1}]
[]
["Zufallszahlen im 3. Jahr","Firma A","Firma B","Firma C","Firma D","Firma E"]
["Albert Adam",{"$f":"IF(AND(B5=$H$5,$I$5>1),RAND(),\"\")","v":0.92456714152754382},{"$f":"IF(AND(C5=$H$5,$I$5>1),RAND(),\"\")","v":0.87427927286608975},{"$f":"IF(AND(D5=$H$5,$I$5>1),RAND(),\"\")","v":0.32649226572336632},{"$f":"IF(AND(E5=$H$5,$I$5>1),RAND(),\"\")","v":0.25929698378430877},{"$f":"IF(AND(F5=$H$5,$I$5>1),RAND(),\"\")","v":0.8660122182630815}]
["Bertha Binnig",{"$f":"IF(AND(B6=$H$6,$I$6>1,B31>1,B31<>\"na\"),RAND(),\"\")","v":""},{"$f":"IF(AND(C6=$H$6,$I$6>1,C31>1,C31<>\"na\"),RAND(),\"\")","v":""},{"$f":"IF(AND(D6=$H$6,$I$6>1,D31>1,D31<>\"na\"),RAND(),\"\")","v":""},{"$f":"IF(AND(E6=$H$6,$I$6>1,E31>1,E31<>\"na\"),RAND(),\"\")","v":""},{"$f":"IF(AND(F6=$H$6,$I$6>1,F31>1,F31<>\"na\"),RAND(),\"\")","v":""}]
["Claudia Custer",{"$f":"IF(AND(B7=$H$7,$I$7>1,B32>1,B32<>\"na\"),RAND(),\"\")","v":""},{"$f":"IF(AND(C7=$H$7,$I$7>1,C32>1,C32<>\"na\"),RAND(),\"\")","v":""},{"$f":"IF(AND(D7=$H$7,$I$7>1,D32>1,D32<>\"na\"),RAND(),\"\")","v":""},{"$f":"IF(AND(E7=$H$7,$I$7>1,E32>1,E32<>\"na\"),RAND(),\"\")","v":""},{"$f":"IF(AND(F7=$H$7,$I$7>1,F32>1,F32<>\"na\"),RAND(),\"\")","v":""}]
["Dieter Diem",{"$f":"IF(AND(B8=$H$8,$I$8>1,B33>1,B33<>\"na\"),RAND(),\"\")","v":""},{"$f":"IF(AND(C8=$H$8,$I$8>1,C33>1,C33<>\"na\"),RAND(),\"\")","v":""},{"$f":"IF(AND(D8=$H$8,$I$8>1,D33>1,D33<>\"na\"),RAND(),\"\")","v":""},{"$f":"IF(AND(E8=$H$8,$I$8>1,E33>1,E33<>\"na\"),RAND(),\"\")","v":""},{"$f":"IF(AND(F8=$H$8,$I$8>1,F33>1,F33<>\"na\"),RAND(),\"\")","v":""}]
[]
["Chiffres aléatoires la 3e année","Entreprise A","Entreprise B","Entreprise C","Entreprise D","Entreprise E"]
["Albert Adam"]
["Bertha Binnig"]
["Claudia Custer"]
["Dieter Diem"]
[]
["Angebote* im 3. Jahr","Firma A","Firma B","Firma C","Firma D","Firma E"]
["Albert Adam",{"$f":"IF(AND($I$5>1,B5=$H$5),B5+1*B18,B5)","v":0},{"$f":"IF(AND($I$5>1,C5=$H$5),C5+1*C18,C5)","v":0},{"$f":"IF(AND($I$5>1,D5=$H$5),D5+1*D18,D5)","v":0},{"$f":"IF(AND($I$5>1,E5=$H$5),E5+1*E18,E5)","v":0},{"$f":"IF(AND($I$5>1,F5=$H$5),F5+1*F18,F5)","v":0}]
["Bertha Binnig",{"$f":"IF(AND($I$6>1,B6=$H$6),B6+1*B19,B6)","v":0},{"$f":"IF(AND($I$6>1,C6=$H$6),C6+1*C19,C6)","v":0},{"$f":"IF(AND($I$6>1,D6=$H$6),D6+1*D19,D6)","v":0},{"$f":"IF(AND($I$6>1,E6=$H$6),E6+1*E19,E6)","v":0},{"$f":"IF(AND($I$6>1,F6=$H$6),F6+1*F19,F6)","v":0}]
["Claudia Custer",{"$f":"IF(AND($I$7>1,B7=$H$7),B7+1*B20,B7)","v":0},{"$f":"IF(AND($I$7>1,C7=$H$7),C7+1*C20,C7)","v":0},{"$f":"IF(AND($I$7>1,D7=$H$7),D7+1*D20,D7)","v":0},{"$f":"IF(AND($I$7>1,E7=$H$7),E7+1*E20,E7)","v":0},{"$f":"IF(AND($I$7>1,F7=$H$7),F7+1*F20,F7)","v":0}]
["Dieter Diem",{"$f":"IF(AND($I$8>1,B8=$H$8),B8+1*B21,B8)","v":0},{"$f":"IF(AND($I$8>1,C8=$H$8),C8+1*C21,C8)","v":0},{"$f":"IF(AND($I$8>1,D8=$H$8),D8+1*D21,D8)","v":0},{"$f":"IF(AND($I$8>1,E8=$H$8),E8+1*E21,E8)","v":0},{"$f":"IF(AND($I$8>1,F8=$H$8),F8+1*F21,F8)","v":0}]
["Normal",{"$f":"B9","v":300000},{"$f":"C9","v":300000},{"$f":"D9","v":300000},{"$f":"E9","v":300000},{"$f":"F9","v":300000}]
[]
["Classement la 3e année","Entreprise A","Entreprise B","Entreprise C","Entreprise D","Entreprise E"]
["Albert Adam",{"$f":"RANK(B24,$B$24:$F$24)","v":1},{"$f":"RANK(C24,$B$24:$F$24)","v":1},{"$f":"RANK(D24,$B$24:$F$24)","v":1},{"$f":"RANK(E24,$B$24:$F$24)","v":1},{"$f":"RANK(F24,$B$24:$F$24)","v":1}]
["Bertha Binnig",{"$f":"IF(AND(B$31>1,B$31<>\"NA\"),COUNTIFS($B$25:$F$25,\">\"&B25,$B$31:$F$31,\">\"&1)+1,\"NA\")","v":"NA"},{"$f":"IF(AND(C$31>1,C$31<>\"NA\"),COUNTIFS($B$25:$F$25,\">\"&C25,$B$31:$F$31,\">\"&1)+1,\"NA\")","v":"NA"},{"$f":"IF(AND(D$31>1,D$31<>\"NA\"),COUNTIFS($B$25:$F$25,\">\"&D25,$B$31:$F$31,\">\"&1)+1,\"NA\")","v":"NA"},{"$f":"IF(AND(E$31>1,E$31<>\"NA\"),COUNTIFS($B$25:$F$25,\">\"&E25,$B$31:$F$31,\">\"&1)+1,\"NA\")","v":"NA"},{"$f":"IF(AND(F$31>1,F$31<>\"NA\"),COUNTIFS($B$25:$F$25,\">\"&F25,$B$31:$F$31,\">\"&1)+1,\"NA\")","v":"NA"}]
["Claudia Custer",{"$f":"IF(AND(B$32>1,B$32<>\"NA\"),COUNTIFS($B$26:$F$26,\">\"&B26,$B$32:$F$32,\">\"&1)+1,\"NA\")","v":"NA"},{"$f":"IF(AND(C$32>1,C$32<>\"NA\"),COUNTIFS($B$26:$F$26,\">\"&C26,$B$32:$F$32,\">\"&1)+1,\"NA\")","v":"NA"},{"$f":"IF(AND(D$32>1,D$32<>\"NA\"),COUNTIFS($B$26:$F$26,\">\"&D26,$B$32:$F$32,\">\"&1)+1,\"NA\")","v":"NA"},{"$f":"IF(AND(E$32>1,E$32<>\"NA\"),COUNTIFS($B$26:$F$26,\">\"&E26,$B$32:$F$32,\">\"&1)+1,\"NA\")","v":"NA"},{"$f":"IF(AND(F$32>1,F$32<>\"NA\"),COUNTIFS($B$26:$F$26,\">\"&F26,$B$32:$F$32,\">\"&1)+1,\"NA\")","v":"NA"}]
["Dieter Diem",{"$f":"IF(AND(B$33>1,B$33<>\"NA\"),COUNTIFS($B$27:$F$27,\">\"&B27,$B$33:$F$33,\">\"&1)+1,\"NA\")","v":"NA"},{"$f":"IF(AND(C$33>1,C$33<>\"NA\"),COUNTIFS($B$27:$F$27,\">\"&C27,$B$33:$F$33,\">\"&1)+1,\"NA\")","v":"NA"},{"$f":"IF(AND(D$33>1,D$33<>\"NA\"),COUNTIFS($B$27:$F$27,\">\"&D27,$B$33:$F$33,\">\"&1)+1,\"NA\")","v":"NA"},{"$f":"IF(AND(E$33>1,E$33<>\"NA\"),COUNTIFS($B$27:$F$27,\">\"&E27,$B$33:$F$33,\">\"&1)+1,\"NA\")","v":"NA"},{"$f":"IF(AND(F$33>1,F$33<>\"NA\"),COUNTIFS($B$27:$F$27,\">\"&F27,$B$33:$F$33,\">\"&1)+1,\"NA\")","v":"NA"}]
["Cadre dirigeant/-e normal/-e",{"$f":"IF(AND(B$34>1,B$34<>\"NA\"),COUNTIFS($B$28:$F$28,\">\"&B28,$B$34:$F$34,\">\"&1)+1,\"NA\")","v":"NA"},{"$f":"IF(AND(C$34>1,C$34<>\"NA\"),COUNTIFS($B$28:$F$28,\">\"&C28,$B$34:$F$34,\">\"&1)+1,\"NA\")","v":"NA"},{"$f":"IF(AND(D$34>1,D$34<>\"NA\"),COUNTIFS($B$28:$F$28,\">\"&D28,$B$34:$F$34,\">\"&1)+1,\"NA\")","v":"NA"},{"$f":"IF(AND(E$34>1,E$34<>\"NA\"),COUNTIFS($B$28:$F$28,\">\"&E28,$B$34:$F$34,\">\"&1)+1,\"NA\")","v":"NA"},{"$f":"IF(AND(F$34>1,F$34<>\"NA\"),COUNTIFS($B$28:$F$28,\">\"&F28,$B$34:$F$34,\">\"&1)+1,\"NA\")","v":"NA"}]
[]
["Offres la 3e année","Entreprise A","Entreprise B","Entreprise C","Entreprise D","Entreprise E",null,"Affectation","Entreprise","Salaire annuel"]
["Albert Adam",{"$f":"B5","v":0},0,0,0,0,null,"Albert Adam",{"$f":"INDEX($B$30:$F$30,MATCH(1,B31:F31,0))","v":"Entreprise A"},{"$f":"INDEX(B5:F5,MATCH(I38,$B$4:$F$4,0))","v":0},null,null,"Retour au mode d’emploi"]
["Bertha Binnig",0,0,0,0,0,null,"Bertha Binnig",{"$f":"INDEX($B$30:$F$30,MATCH(1,B32:F32,0))","v":{"$error":"#N/A"}},{"$f":"INDEX(B6:F6,MATCH(I39,$B$4:$F$4,0))","v":{"$error":"#N/A"}}]
["Claudia Custer",0,0,0,0,0,null,"Claudia Custer",{"$f":"INDEX($B$30:$F$30,MATCH(1,B33:F33,0))","v":{"$error":"#N/A"}},{"$f":"INDEX(B7:F7,MATCH(I40,$B$4:$F$4,0))","v":{"$error":"#N/A"}}]
["Dieter Diem",{"$f":"B8","v":0},0,0,0,0,null,"Dieter Diem",{"$f":"INDEX($B$30:$F$30,MATCH(1,B34:F34,0))","v":{"$error":"#N/A"}},{"$f":"INDEX(B8:F8,MATCH(I41,$B$4:$F$4,0))","v":{"$error":"#N/A"}}]
["Cadre dirigeant/-e normal/-e",{"$f":"B9","v":300000},{"$f":"C9","v":300000},{"$f":"D9","v":300000},{"$f":"E9","v":300000},{"$f":"F9","v":300000},null,"Cadre dirigeant/-e normal/-e",{"$f":"INDEX($B$30:$F$30,MATCH(1,B35:F35,0))","v":{"$error":"#N/A"}},{"$f":"INDEX(B9:F9,MATCH(I42,$B$4:$F$4,0))","v":{"$error":"#N/A"}},null,null,"Passer à l’évaluation des salaires des dirigeants"]

{"sheet":"4e année","index":10,"n_rows":42,"n_cols":13,"rows_kept":42,"cut":false,"hidden":false,"merged":[[8,7,8,9]]}
["Théorie des jeux - Hauts salaires"]
["Jeu éducatif sur les salaires des dirigeants - Affectation des dirigeants (4e année)"]
[]
["Offres la 4e année","Entreprise A","Entreprise B","Entreprise C","Entreprise D","Entreprise E",null,"Maximum","# Maxima","Tirage au sort"]
["Albert Adam",{"$f":"'Entreprise A'!G14","v":0},{"$f":"'Entreprise B'!G14","v":0},{"$f":"'Entreprise C'!G14","v":0},{"$f":"'Entreprise D'!G14","v":0},{"$f":"'Entreprise E'!G14","v":0},null,{"$f":"MAX(B5:F5)","v":0},{"$f":"COUNTIF(B5:F5,H5)","v":5},{"$f":"IF(I5>1,\"OUI\",\"NON\")","v":"OUI"},"NON"]
["Bertha Binnig",{"$f":"'Entreprise A'!G15","v":0},{"$f":"'Entreprise B'!G15","v":0},{"$f":"'Entreprise C'!G15","v":0},{"$f":"'Entreprise D'!G15","v":0},{"$f":"'Entreprise E'!G15","v":0},null,{"$f":"MAX(IF(B31:F31>1,IF(ISNUMBER(B31:F31)=TRUE,B6:F6)))","v":0},{"$f":"COUNTIFS(B6:F6,H6,B31:F31,\"<>1\",B31:F31,\"<>NA\")","v":0},{"$f":"IF(I6>1,\"OUI\",\"NON\")","v":"NON"},"NON"]
["Claudia Custer",{"$f":"'Entreprise A'!G16","v":0},{"$f":"'Entreprise B'!G16","v":0},{"$f":"'Entreprise C'!G16","v":0},{"$f":"'Entreprise D'!G16","v":0},{"$f":"'Entreprise E'!G16","v":0},null,{"$f":"MAX(IF(B32:F32>1,IF(ISNUMBER(B32:F32)=TRUE,B7:F7)))","v":0},{"$f":"COUNTIFS(B7:F7,H7,B32:F32,\"<>1\",B32:F32,\"<>NA\")","v":0},{"$f":"IF(I7>1,\"OUI\",\"NON\")","v":"NON"},"NON"]
["Dieter Diem",{"$f":"'Entreprise A'!G17","v":0},{"$f":"'Entreprise B'!G17","v":0},{"$f":"'Entreprise C'!G17","v":0},{"$f":"'Entreprise D'!G17","v":0},{"$f":"'Entreprise E'!G17","v":0},null,{"$f":"MAX(IF(B33:F33>1,IF(ISNUMBER(B33:F33)=TRUE,B8:F8)))","v":0},{"$f":"COUNTIFS(B8:F8,H8,B33:F33,\"<>1\",B33:F33,\"<>NA\")","v":0},{"$f":"IF(I8>1,\"OUI\",\"NON\")","v":"NON"},"NON"]
["Cadre dirigeant/-e normal/-e",{"$f":"'Entreprise A'!G18","v":300000},{"$f":"'Entreprise B'!G18","v":300000},{"$f":"'Entreprise C'!G18","v":300000},{"$f":"'Entreprise D'!G18","v":300000},{"$f":"'Entreprise E'!G18","v":300000},null,{"$f":"IF(K9=0,\"Vous n'avez plus besoin de faire de tirage au sort!\",\"Vous devez procéder à encore un tirage au sort au moins!\")","v":"Vous devez procéder à encore un tirage au sort au moins!"},null,null,{"$f":"IF(OR(J5=\"OUI\",J6=\"OUI\",J7=\"OUI\",J8=\"OUI\"),IF(J5=K5,IF(J6=K6,IF(J7=K7,IF(J8=K8,0,1),1),1),1),0)","v":1}]
[]
["Zufallszahlen im 4. Jahr","Firma A","Firma B","Firma C","Firma D","Firma E"]
["Albert Adam",{"$f":"IF(AND(B5=$H$5,$I$5>1),RAND(),\"\")","v":3.1985111410351208E-2},{"$f":"IF(AND(C5=$H$5,$I$5>1),RAND(),\"\")","v":0.35644700212076097},{"$f":"IF(AND(D5=$H$5,$I$5>1),RAND(),\"\")","v":0.65544053341031705},{"$f":"IF(AND(E5=$H$5,$I$5>1),RAND(),\"\")","v":0.40710828075769534},{"$f":"IF(AND(F5=$H$5,$I$5>1),RAND(),\"\")","v":0.90053284576356707}]
["Bertha Binnig",{"$f":"IF(AND(B6=$H$6,$I$6>1,B31>1,B31<>\"na\"),RAND(),\"\")","v":""},{"$f":"IF(AND(C6=$H$6,$I$6>1,C31>1,C31<>\"na\"),RAND(),\"\")","v":""},{"$f":"IF(AND(D6=$H$6,$I$6>1,D31>1,D31<>\"na\"),RAND(),\"\")","v":""},{"$f":"IF(AND(E6=$H$6,$I$6>1,E31>1,E31<>\"na\"),RAND(),\"\")","v":""},{"$f":"IF(AND(F6=$H$6,$I$6>1,F31>1,F31<>\"na\"),RAND(),\"\")","v":""}]
["Claudia Custer",{"$f":"IF(AND(B7=$H$7,$I$7>1,B32>1,B32<>\"na\"),RAND(),\"\")","v":""},{"$f":"IF(AND(C7=$H$7,$I$7>1,C32>1,C32<>\"na\"),RAND(),\"\")","v":""},{"$f":"IF(AND(D7=$H$7,$I$7>1,D32>1,D32<>\"na\"),RAND(),\"\")","v":""},{"$f":"IF(AND(E7=$H$7,$I$7>1,E32>1,E32<>\"na\"),RAND(),\"\")","v":""},{"$f":"IF(AND(F7=$H$7,$I$7>1,F32>1,F32<>\"na\"),RAND(),\"\")","v":""}]
["Dieter Diem",{"$f":"IF(AND(B8=$H$8,$I$8>1,B33>1,B33<>\"na\"),RAND(),\"\")","v":""},{"$f":"IF(AND(C8=$H$8,$I$8>1,C33>1,C33<>\"na\"),RAND(),\"\")","v":""},{"$f":"IF(AND(D8=$H$8,$I$8>1,D33>1,D33<>\"na\"),RAND(),\"\")","v":""},{"$f":"IF(AND(E8=$H$8,$I$8>1,E33>1,E33<>\"na\"),RAND(),\"\")","v":""},{"$f":"IF(AND(F8=$H$8,$I$8>1,F33>1,F33<>\"na\"),RAND(),\"\")","v":""}]
[]
["Chiffres aléatoires la 4e année","Entreprise A","Entreprise B","Entreprise C","Entreprise D","Entreprise E"]
["Albert Adam"]
["Bertha Binnig"]
["Claudia Custer"]
["Dieter Diem"]
[]
["Angebote* im 4. Jahr","Firma A","Firma B","Firma C","Firma D","Firma E"]
["Albert Adam",{"$f":"IF(AND($I$5>1,B5=$H$5),B5+1*B18,B5)","v":0},{"$f":"IF(AND($I$5>1,C5=$H$5),C5+1*C18,C5)","v":0},{"$f":"IF(AND($I$5>1,D5=$H$5),D5+1*D18,D5)","v":0},{"$f":"IF(AND($I$5>1,E5=$H$5),E5+1*E18,E5)","v":0},{"$f":"IF(AND($I$5>1,F5=$H$5),F5+1*F18,F5)","v":0}]
["Bertha Binnig",{"$f":"IF(AND($I$6>1,B6=$H$6),B6+1*B19,B6)","v":0},{"$f":"IF(AND($I$6>1,C6=$H$6),C6+1*C19,C6)","v":0},{"$f":"IF(AND($I$6>1,D6=$H$6),D6+1*D19,D6)","v":0},{"$f":"IF(AND($I$6>1,E6=$H$6),E6+1*E19,E6)","v":0},{"$f":"IF(AND($I$6>1,F6=$H$6),F6+1*F19,F6)","v":0}]
["Claudia Custer",{"$f":"IF(AND($I$7>1,B7=$H$7),B7+1*B20,B7)","v":0},{"$f":"IF(AND($I$7>1,C7=$H$7),C7+1*C20,C7)","v":0},{"$f":"IF(AND($I$7>1,D7=$H$7),D7+1*D20,D7)","v":0},{"$f":"IF(AND($I$7>1,E7=$H$7),E7+1*E20,E7)","v":0},{"$f":"IF(AND($I$7>1,F7=$H$7),F7+1*F20,F7)","v":0}]
["Dieter Diem",{"$f":"IF(AND($I$8>1,B8=$H$8),B8+1*B21,B8)","v":0},{"$f":"IF(AND($I$8>1,C8=$H$8),C8+1*C21,C8)","v":0},{"$f":"IF(AND($I$8>1,D8=$H$8),D8+1*D21,D8)","v":0},{"$f":"IF(AND($I$8>1,E8=$H$8),E8+1*E21,E8)","v":0},{"$f":"IF(AND($I$8>1,F8=$H$8),F8+1*F21,F8)","v":0}]
["Normal",{"$f":"B9","v":300000},{"$f":"C9","v":300000},{"$f":"D9","v":300000},{"$f":"E9","v":300000},{"$f":"F9","v":300000}]
[]
["Classement la 4e année","Entreprise A","Entreprise B","Entreprise C","Entreprise D","Entreprise E"]
["Albert Adam",{"$f":"RANK(B24,$B$24:$F$24)","v":1},{"$f":"RANK(C24,$B$24:$F$24)","v":1},{"$f":"RANK(D24,$B$24:$F$24)","v":1},{"$f":"RANK(E24,$B$24:$F$24)","v":1},{"$f":"RANK(F24,$B$24:$F$24)","v":1}]
["Bertha Binnig",{"$f":"IF(AND(B$31>1,B$31<>\"NA\"),COUNTIFS($B$25:$F$25,\">\"&B25,$B$31:$F$31,\">\"&1)+1,\"NA\")","v":"NA"},{"$f":"IF(AND(C$31>1,C$31<>\"NA\"),COUNTIFS($B$25:$F$25,\">\"&C25,$B$31:$F$31,\">\"&1)+1,\"NA\")","v":"NA"},{"$f":"IF(AND(D$31>1,D$31<>\"NA\"),COUNTIFS($B$25:$F$25,\">\"&D25,$B$31:$F$31,\">\"&1)+1,\"NA\")","v":"NA"},{"$f":"IF(AND(E$31>1,E$31<>\"NA\"),COUNTIFS($B$25:$F$25,\">\"&E25,$B$31:$F$31,\">\"&1)+1,\"NA\")","v":"NA"},{"$f":"IF(AND(F$31>1,F$31<>\"NA\"),COUNTIFS($B$25:$F$25,\">\"&F25,$B$31:$F$31,\">\"&1)+1,\"NA\")","v":"NA"}]
["Claudia Custer",{"$f":"IF(AND(B$32>1,B$32<>\"NA\"),COUNTIFS($B$26:$F$26,\">\"&B26,$B$32:$F$32,\">\"&1)+1,\"NA\")","v":"NA"},{"$f":"IF(AND(C$32>1,C$32<>\"NA\"),COUNTIFS($B$26:$F$26,\">\"&C26,$B$32:$F$32,\">\"&1)+1,\"NA\")","v":"NA"},{"$f":"IF(AND(D$32>1,D$32<>\"NA\"),COUNTIFS($B$26:$F$26,\">\"&D26,$B$32:$F$32,\">\"&1)+1,\"NA\")","v":"NA"},{"$f":"IF(AND(E$32>1,E$32<>\"NA\"),COUNTIFS($B$26:$F$26,\">\"&E26,$B$32:$F$32,\">\"&1)+1,\"NA\")","v":"NA"},{"$f":"IF(AND(F$32>1,F$32<>\"NA\"),COUNTIFS($B$26:$F$26,\">\"&F26,$B$32:$F$32,\">\"&1)+1,\"NA\")","v":"NA"}]
["Dieter Diem",{"$f":"IF(AND(B$33>1,B$33<>\"NA\"),COUNTIFS($B$27:$F$27,\">\"&B27,$B$33:$F$33,\">\"&1)+1,\"NA\")","v":"NA"},{"$f":"IF(AND(C$33>1,C$33<>\"NA\"),COUNTIFS($B$27:$F$27,\">\"&C27,$B$33:$F$33,\">\"&1)+1,\"NA\")","v":"NA"},{"$f":"IF(AND(D$33>1,D$33<>\"NA\"),COUNTIFS($B$27:$F$27,\">\"&D27,$B$33:$F$33,\">\"&1)+1,\"NA\")","v":"NA"},{"$f":"IF(AND(E$33>1,E$33<>\"NA\"),COUNTIFS($B$27:$F$27,\">\"&E27,$B$33:$F$33,\">\"&1)+1,\"NA\")","v":"NA"},{"$f":"IF(AND(F$33>1,F$33<>\"NA\"),COUNTIFS($B$27:$F$27,\">\"&F27,$B$33:$F$33,\">\"&1)+1,\"NA\")","v":"NA"}]
["Cadre dirigeant/-e normal/-e",{"$f":"IF(AND(B$34>1,B$34<>\"NA\"),COUNTIFS($B$28:$F$28,\">\"&B28,$B$34:$F$34,\">\"&1)+1,\"NA\")","v":"NA"},{"$f":"IF(AND(C$34>1,C$34<>\"NA\"),COUNTIFS($B$28:$F$28,\">\"&C28,$B$34:$F$34,\">\"&1)+1,\"NA\")","v":"NA"},{"$f":"IF(AND(D$34>1,D$34<>\"NA\"),COUNTIFS($B$28:$F$28,\">\"&D28,$B$34:$F$34,\">\"&1)+1,\"NA\")","v":"NA"},{"$f":"IF(AND(E$34>1,E$34<>\"NA\"),COUNTIFS($B$28:$F$28,\">\"&E28,$B$34:$F$34,\">\"&1)+1,\"NA\")","v":"NA"},{"$f":"IF(AND(F$34>1,F$34<>\"NA\"),COUNTIFS($B$28:$F$28,\">\"&F28,$B$34:$F$34,\">\"&1)+1,\"NA\")","v":"NA"}]
[]
["Offres la 4e année","Entreprise A","Entreprise B","Entreprise C","Entreprise D","Entreprise E",null,"Affectation","Entreprise","Salaire annuel"]
["Albert Adam",{"$f":"B5","v":0},0,0,0,0,null,"Albert Adam",{"$f":"INDEX($B$30:$F$30,MATCH(1,B31:F31,0))","v":"Entreprise A"},{"$f":"INDEX(B5:F5,MATCH(I38,$B$4:$F$4,0))","v":0},null,null,"Retour au mode d’emploi"]
["Bertha Binnig",0,0,0,0,0,null,"Bertha Binnig",{"$f":"INDEX($B$30:$F$30,MATCH(1,B32:F32,0))","v":{"$error":"#N/A"}},{"$f":"INDEX(B6:F6,MATCH(I39,$B$4:$F$4,0))","v":{"$error":"#N/A"}}]
["Claudia Custer",0,0,0,0,0,null,"Claudia Custer",{"$f":"INDEX($B$30:$F$30,MATCH(1,B33:F33,0))","v":{"$error":"#N/A"}},{"$f":"INDEX(B7:F7,MATCH(I40,$B$4:$F$4,0))","v":{"$error":"#N/A"}}]
["Dieter Diem",{"$f":"B8","v":0},0,0,0,0,null,"Dieter Diem",{"$f":"INDEX($B$30:$F$30,MATCH(1,B34:F34,0))","v":{"$error":"#N/A"}},{"$f":"INDEX(B8:F8,MATCH(I41,$B$4:$F$4,0))","v":{"$error":"#N/A"}}]
["Cadre dirigeant/-e normal/-e",{"$f":"B9","v":300000},{"$f":"C9","v":300000},{"$f":"D9","v":300000},{"$f":"E9","v":300000},{"$f":"F9","v":300000},null,"Cadre dirigeant/-e normal/-e",{"$f":"INDEX($B$30:$F$30,MATCH(1,B35:F35,0))","v":{"$error":"#N/A"}},{"$f":"INDEX(B9:F9,MATCH(I42,$B$4:$F$4,0))","v":{"$error":"#N/A"}},null,null,"Passer à l’évaluation des salaires des dirigeants"]

{"sheet":"Évaluation des salaires des dir","index":11,"n_rows":9,"n_cols":8,"rows_kept":9,"cut":false,"hidden":false,"merged":[]}
["Théorie des jeux - Hauts salaires"]
["Jeu éducatif sur les salaires des dirigeants - Evaluation du salaire annuel des dirigeants"]
[]
["CEO","1re année","2e année","3e année","4e année"]
["Albert Adam",{"$f":"INDEX('1re année'!$J$38:$J$42,MATCH(A5,'1re année'!$H$38:$H$42,0))","v":0},{"$f":"INDEX('2e année'!$J$38:$J$42,MATCH(A5,'2e année'!$H$38:$H$42,0))","v":0},{"$f":"INDEX('3e année'!$J$38:$J$42,MATCH(A5,'3e année'!$H$38:$H$42,0))","v":0},{"$f":"INDEX('4e année'!$J$38:$J$42,MATCH(A5,'4e année'!$H$38:$H$42,0))","v":0}]
["Bertha Binnig",{"$f":"INDEX('1re année'!$J$38:$J$42,MATCH(A6,'1re année'!$H$38:$H$42,0))","v":{"$error":"#N/A"}},{"$f":"INDEX('2e année'!$J$38:$J$42,MATCH(A6,'2e année'!$H$38:$H$42,0))","v":{"$error":"#N/A"}},{"$f":"INDEX('3e année'!$J$38:$J$42,MATCH(A6,'3e année'!$H$38:$H$42,0))","v":{"$error":"#N/A"}},{"$f":"INDEX('4e année'!$J$38:$J$42,MATCH(A6,'4e année'!$H$38:$H$42,0))","v":{"$error":"#N/A"}}]
["Claudia Custer",{"$f":"INDEX('1re année'!$J$38:$J$42,MATCH(A7,'1re année'!$H$38:$H$42,0))","v":{"$error":"#N/A"}},{"$f":"INDEX('2e année'!$J$38:$J$42,MATCH(A7,'2e année'!$H$38:$H$42,0))","v":{"$error":"#N/A"}},{"$f":"INDEX('3e année'!$J$38:$J$42,MATCH(A7,'3e année'!$H$38:$H$42,0))","v":{"$error":"#N/A"}},{"$f":"INDEX('4e année'!$J$38:$J$42,MATCH(A7,'4e année'!$H$38:$H$42,0))","v":{"$error":"#N/A"}}]
["Dieter Diem",{"$f":"INDEX('1re année'!$J$38:$J$42,MATCH(A8,'1re année'!$H$38:$H$42,0))","v":{"$error":"#N/A"}},{"$f":"INDEX('2e année'!$J$38:$J$42,MATCH(A8,'2e année'!$H$38:$H$42,0))","v":{"$error":"#N/A"}},{"$f":"INDEX('3e année'!$J$38:$J$42,MATCH(A8,'3e année'!$H$38:$H$42,0))","v":{"$error":"#N/A"}},{"$f":"INDEX('4e année'!$J$38:$J$42,MATCH(A8,'4e année'!$H$38:$H$42,0))","v":{"$error":"#N/A"}}]
["Cadre dirigeant/-e normal/-e",{"$f":"INDEX('1re année'!$J$38:$J$42,MATCH(A9,'1re année'!$H$38:$H$42,0))","v":{"$error":"#N/A"}},{"$f":"INDEX('2e année'!$J$38:$J$42,MATCH(A9,'2e année'!$H$38:$H$42,0))","v":{"$error":"#N/A"}},{"$f":"INDEX('3e année'!$J$38:$J$42,MATCH(A9,'3e année'!$H$38:$H$42,0))","v":{"$error":"#N/A"}},{"$f":"INDEX('4e année'!$J$38:$J$42,MATCH(A9,'4e année'!$H$38:$H$42,0))","v":{"$error":"#N/A"}},null,null,"Passer à l’évaluation des entreprises"]

{"sheet":"Évaluation des entreprises","index":12,"n_rows":34,"n_cols":11,"rows_kept":34,"cut":false,"hidden":false,"merged":[[3,1,5,1],[3,7,5,7],[3,6,5,6],[3,5,5,5],[3,4,5,4],[3,3,5,3],[3,2,5,2]]}
["Théorie des jeux - Hauts salaires"]
["Jeu éducatif sur les salaires des dirigeants - Evaluation des entreprises"]
[]
[null,"Se reporter aux données de base","Se reporter à l’année correspondante","Se reporter aux données de base","Rendements des capitaux (bruts, en %) * Capitalisation","Se reporter à l’année correspondante","Bénéfices (bruts, en CHF) - salaire annuel (en CHF)","Bénéfices (nets, en CHF) / capitalisation",null,null,"Retour à l’entreprise A"]
[]
[null,null,null,null,null,null,null,null,null,null,"Passer aux graphiques"]
[]
["1re année","Capitalisation","CEO","Rendements bruts des capitaux, en %","Bénéfices bruts, en CHF","Salaire annuel, en CHF","Bénéfices nets, en CHF","Rendements nets des capitaux, en %"]
["Entreprise A",{"$f":"INDEX('Données de base'!$B$14:$B$18,MATCH(A9,'Données de base'!$A$14:$A$18,0))","v":5000000},{"$f":"INDEX('1re année'!$H$38:$H$42,MATCH('Évaluation des entreprises'!A9,'1re année'!$I$38:$I$42,0))","v":"Albert Adam"},{"$f":"INDEX('Données de base'!$B$6:$B$10,MATCH(C9,'Données de base'!$A$6:$A$10,0))","v":0.14000000000000001},{"$f":"D9*B9","v":700000.00000000012},{"$f":"INDEX('1re année'!$J$38:$J$42,MATCH('Évaluation des entreprises'!A9,'1re année'!$I$38:$I$42,0))","v":0},{"$f":"E9-F9","v":700000.00000000012},{"$f":"G9/B9","v":0.14000000000000001}]
["Entreprise B",{"$f":"INDEX('Données de base'!$B$14:$B$18,MATCH(A10,'Données de base'!$A$14:$A$18,0))","v":10000000},{"$f":"INDEX('1re année'!$H$38:$H$42,MATCH('Évaluation des entreprises'!A10,'1re année'!$I$38:$I$42,0))","v":{"$error":"#N/A"}},{"$f":"INDEX('Données de base'!$B$6:$B$10,MATCH(C10,'Données de base'!$A$6:$A$10,0))","v":{"$error":"#N/A"}},{"$f":"D10*B10","v":{"$error":"#N/A"}},{"$f":"INDEX('1re année'!$J$38:$J$42,MATCH('Évaluation des entreprises'!A10,'1re année'!$I$38:$I$42,0))","v":{"$error":"#N/A"}},{"$f":"E10-F10","v":{"$error":"#N/A"}},{"$f":"G10/B10","v":{"$error":"#N/A"}}]
["Entreprise C",{"$f":"INDEX('Données de base'!$B$14:$B$18,MATCH(A11,'Données de base'!$A$14:$A$18,0))","v":30000000},{"$f":"INDEX('1re année'!$H$38:$H$42,MATCH('Évaluation des entreprises'!A11,'1re année'!$I$38:$I$42,0))","v":{"$error":"#N/A"}},{"$f":"INDEX('Données de base'!$B$6:$B$10,MATCH(C11,'Données de base'!$A$6:$A$10,0))","v":{"$error":"#N/A"}},{"$f":"D11*B11","v":{"$error":"#N/A"}},{"$f":"INDEX('1re année'!$J$38:$J$42,MATCH('Évaluation des entreprises'!A11,'1re année'!$I$38:$I$42,0))","v":{"$error":"#N/A"}},{"$f":"E11-F11","v":{"$error":"#N/A"}},{"$f":"G11/B11","v":{"$error":"#N/A"}}]
["Entreprise D",{"$f":"INDEX('Données de base'!$B$14:$B$18,MATCH(A12,'Données de base'!$A$14:$A$18,0))","v":400000000},{"$f":"INDEX('1re année'!$H$38:$H$42,MATCH('Évaluation des entreprises'!A12,'1re année'!$I$38:$I$42,0))","v":{"$error":"#N/A"}},{"$f":"INDEX('Données de base'!$B$6:$B$10,MATCH(C12,'Données de base'!$A$6:$A$10,0))","v":{"$error":"#N/A"}},{"$f":"D12*B12","v":{"$error":"#N/A"}},{"$f":"INDEX('1re année'!$J$38:$J$42,MATCH('Évaluation des entreprises'!A12,'1re année'!$I$38:$I$42,0))","v":{"$error":"#N/A"}},{"$f":"E12-F12","v":{"$error":"#N/A"}},{"$f":"G12/B12","v":{"$error":"#N/A"}}]
["Entreprise E",{"$f":"INDEX('Données de base'!$B$14:$B$18,MATCH(A13,'Données de base'!$A$14:$A$18,0))","v":7000000000},{"$f":"INDEX('1re année'!$H$38:$H$42,MATCH('Évaluation des entreprises'!A13,'1re année'!$I$38:$I$42,0))","v":{"$error":"#N/A"}},{"$f":"INDEX('Données de base'!$B$6:$B$10,MATCH(C13,'Données de base'!$A$6:$A$10,0))","v":{"$error":"#N/A"}},{"$f":"D13*B13","v":{"$error":"#N/A"}},{"$f":"INDEX('1re année'!$J$38:$J$42,MATCH('Évaluation des entreprises'!A13,'1re année'!$I$38:$I$42,0))","v":{"$error":"#N/A"}},{"$f":"E13-F13","v":{"$error":"#N/A"}},{"$f":"G13/B13","v":{"$error":"#N/A"}},null,null,"Revenir à l’affectation des dirigeants la 1e année"]
[]
["2e année","Capitalisation","CEO","Rendements bruts des capitaux, en %","Bénéfices bruts, en CHF","Salaire annuel, en CHF","Bénéfices nets, en CHF","Rendements nets des capitaux, en %"]
["Entreprise A",{"$f":"INDEX('Données de base'!$B$14:$B$18,MATCH(A16,'Données de base'!$A$14:$A$18,0))","v":5000000},{"$f":"INDEX('2e année'!$H$38:$H$42,MATCH('Évaluation des entreprises'!A16,'2e année'!$I$38:$I$42,0))","v":"Albert Adam"},{"$f":"INDEX('Données de base'!$B$6:$B$10,MATCH(C16,'Données de base'!$A$6:$A$10,0))","v":0.14000000000000001},{"$f":"D16*B16","v":700000.00000000012},{"$f":"INDEX('2e année'!$J$38:$J$42,MATCH('Évaluation des entreprises'!A16,'2e année'!$I$38:$I$42,0))","v":0},{"$f":"E16-F16","v":700000.00000000012},{"$f":"G16/B16","v":0.14000000000000001}]
["Entreprise B",{"$f":"INDEX('Données de base'!$B$14:$B$18,MATCH(A17,'Données de base'!$A$14:$A$18,0))","v":10000000},{"$f":"INDEX('2e année'!$H$38:$H$42,MATCH('Évaluation des entreprises'!A17,'2e année'!$I$38:$I$42,0))","v":{"$error":"#N/A"}},{"$f":"INDEX('Données de base'!$B$6:$B$10,MATCH(C17,'Données de base'!$A$6:$A$10,0))","v":{"$error":"#N/A"}},{"$f":"D17*B17","v":{"$error":"#N/A"}},{"$f":"INDEX('2e année'!$J$38:$J$42,MATCH('Évaluation des entreprises'!A17,'2e année'!$I$38:$I$42,0))","v":{"$error":"#N/A"}},{"$f":"E17-F17","v":{"$error":"#N/A"}},{"$f":"G17/B17","v":{"$error":"#N/A"}}]
["Entreprise C",{"$f":"INDEX('Données de base'!$B$14:$B$18,MATCH(A18,'Données de base'!$A$14:$A$18,0))","v":30000000},{"$f":"INDEX('2e année'!$H$38:$H$42,MATCH('Évaluation des entreprises'!A18,'2e année'!$I$38:$I$42,0))","v":{"$error":"#N/A"}},{"$f":"INDEX('Données de base'!$B$6:$B$10,MATCH(C18,'Données de base'!$A$6:$A$10,0))","v":{"$error":"#N/A"}},{"$f":"D18*B18","v":{"$error":"#N/A"}},{"$f":"INDEX('2e année'!$J$38:$J$42,MATCH('Évaluation des entreprises'!A18,'2e année'!$I$38:$I$42,0))","v":{"$error":"#N/A"}},{"$f":"E18-F18","v":{"$error":"#N/A"}},{"$f":"G18/B18","v":{"$error":"#N/A"}}]
["Entreprise D",{"$f":"INDEX('Données de base'!$B$14:$B$18,MATCH(A19,'Données de base'!$A$14:$A$18,0))","v":400000000},{"$f":"INDEX('2e année'!$H$38:$H$42,MATCH('Évaluation des entreprises'!A19,'2e année'!$I$38:$I$42,0))","v":{"$error":"#N/A"}},{"$f":"INDEX('Données de base'!$B$6:$B$10,MATCH(C19,'Données de base'!$A$6:$A$10,0))","v":{"$error":"#N/A"}},{"$f":"D19*B19","v":{"$error":"#N/A"}},{"$f":"INDEX('2e année'!$J$38:$J$42,MATCH('Évaluation des entreprises'!A19,'2e année'!$I$38:$I$42,0))","v":{"$error":"#N/A"}},{"$f":"E19-F19","v":{"$error":"#N/A"}},{"$f":"G19/B19","v":{"$error":"#N/A"}}]
["Entreprise E",{"$f":"INDEX('Données de base'!$B$14:$B$18,MATCH(A20,'Données de base'!$A$14:$A$18,0))","v":7000000000},{"$f":"INDEX('2e année'!$H$38:$H$42,MATCH('Évaluation des entreprises'!A20,'2e année'!$I$38:$I$42,0))","v":{"$error":"#N/A"}},{"$f":"INDEX('Données de base'!$B$6:$B$10,MATCH(C20,'Données de base'!$A$6:$A$10,0))","v":{"$error":"#N/A"}},{"$f":"D20*B20","v":{"$error":"#N/A"}},{"$f":"INDEX('2e année'!$J$38:$J$42,MATCH('Évaluation des entreprises'!A20,'2e année'!$I$38:$I$42,0))","v":{"$error":"#N/A"}},{"$f":"E20-F20","v":{"$error":"#N/A"}},{"$f":"G20/B20","v":{"$error":"#N/A"}},null,null,"Revenir à l’affectation des dirigeants la 2e année"]
[]
["3e année","Capitalisation","CEO","Rendements bruts des capitaux, en %","Bénéfices bruts, en CHF","Salaire annuel, en CHF","Bénéfices nets, en CHF","Rendements nets des capitaux, en %"]
["Entreprise A",{"$f":"INDEX('Données de base'!$B$14:$B$18,MATCH(A23,'Données de base'!$A$14:$A$18,0))","v":5000000},{"$f":"INDEX('3e année'!$H$38:$H$42,MATCH('Évaluation des entreprises'!A23,'3e année'!$I$38:$I$42,0))","v":"Albert Adam"},{"$f":"INDEX('Données de base'!$B$6:$B$10,MATCH(C23,'Données de base'!$A$6:$A$10,0))","v":0.14000000000000001},{"$f":"D23*B23","v":700000.00000000012},{"$f":"INDEX('3e année'!$J$38:$J$42,MATCH('Évaluation des entreprises'!A23,'3e année'!$I$38:$I$42,0))","v":0},{"$f":"E23-F23","v":700000.00000000012},{"$f":"G23/B23","v":0.14000000000000001}]
["Entreprise B",{"$f":"INDEX('Données de base'!$B$14:$B$18,MATCH(A24,'Données de base'!$A$14:$A$18,0))","v":10000000},{"$f":"INDEX('3e année'!$H$38:$H$42,MATCH('Évaluation des entreprises'!A24,'3e année'!$I$38:$I$42,0))","v":{"$error":"#N/A"}},{"$f":"INDEX('Données de base'!$B$6:$B$10,MATCH(C24,'Données de base'!$A$6:$A$10,0))","v":{"$error":"#N/A"}},{"$f":"D24*B24","v":{"$error":"#N/A"}},{"$f":"INDEX('3e année'!$J$38:$J$42,MATCH('Évaluation des entreprises'!A24,'3e année'!$I$38:$I$42,0))","v":{"$error":"#N/A"}},{"$f":"E24-F24","v":{"$error":"#N/A"}},{"$f":"G24/B24","v":{"$error":"#N/A"}}]
["Entreprise C",{"$f":"INDEX('Données de base'!$B$14:$B$18,MATCH(A25,'Données de base'!$A$14:$A$18,0))","v":30000000},{"$f":"INDEX('3e année'!$H$38:$H$42,MATCH('Évaluation des entreprises'!A25,'3e année'!$I$38:$I$42,0))","v":{"$error":"#N/A"}},{"$f":"INDEX('Données de base'!$B$6:$B$10,MATCH(C25,'Données de base'!$A$6:$A$10,0))","v":{"$error":"#N/A"}},{"$f":"D25*B25","v":{"$error":"#N/A"}},{"$f":"INDEX('3e année'!$J$38:$J$42,MATCH('Évaluation des entreprises'!A25,'3e année'!$I$38:$I$42,0))","v":{"$error":"#N/A"}},{"$f":"E25-F25","v":{"$error":"#N/A"}},{"$f":"G25/B25","v":{"$error":"#N/A"}}]
["Entreprise D",{"$f":"INDEX('Données de base'!$B$14:$B$18,MATCH(A26,'Données de base'!$A$14:$A$18,0))","v":400000000},{"$f":"INDEX('3e année'!$H$38:$H$42,MATCH('Évaluation des entreprises'!A26,'3e année'!$I$38:$I$42,0))","v":{"$error":"#N/A"}},{"$f":"INDEX('Données de base'!$B$6:$B$10,MATCH(C26,'Données de base'!$A$6:$A$10,0))","v":{"$error":"#N/A"}},{"$f":"D26*B26","v":{"$error":"#N/A"}},{"$f":"INDEX('3e année'!$J$38:$J$42,MATCH('Évaluation des entreprises'!A26,'3e année'!$I$38:$I$42,0))","v":{"$error":"#N/A"}},{"$f":"E26-F26","v":{"$error":"#N/A"}},{"$f":"G26/B26","v":{"$error":"#N/A"}}]
["Entreprise E",{"$f":"INDEX('Données de base'!$B$14:$B$18,MATCH(A27,'Données de base'!$A$14:$A$18,0))","v":7000000000},{"$f":"INDEX('3e année'!$H$38:$H$42,MATCH('Évaluation des entreprises'!A27,'3e année'!$I$38:$I$42,0))","v":{"$error":"#N/A"}},{"$f":"INDEX('Données de base'!$B$6:$B$10,MATCH(C27,'Données de base'!$A$6:$A$10,0))","v":{"$error":"#N/A"}},{"$f":"D27*B27","v":{"$error":"#N/A"}},{"$f":"INDEX('3e année'!$J$38:$J$42,MATCH('Évaluation des entreprises'!A27,'3e année'!$I$38:$I$42,0))","v":{"$error":"#N/A"}},{"$f":"E27-F27","v":{"$error":"#N/A"}},{"$f":"G27/B27","v":{"$error":"#N/A"}},null,null,"Revenir à l’affectation des dirigeants la 3e année"]
[]
["4e année","Capitalisation","CEO","Rendements bruts des capitaux, en %","Bénéfices bruts, en CHF","Salaire annuel, en CHF","Bénéfices nets, en CHF","Rendements nets des capitaux, en %"]
["Entreprise A",{"$f":"INDEX('Données de base'!$B$14:$B$18,MATCH(A30,'Données de base'!$A$14:$A$18,0))","v":5000000},{"$f":"INDEX('4e année'!$H$38:$H$42,MATCH('Évaluation des entreprises'!A30,'4e année'!$I$38:$I$42,0))","v":"Albert Adam"},{"$f":"INDEX('Données de base'!$B$6:$B$10,MATCH(C30,'Données de base'!$A$6:$A$10,0))","v":0.14000000000000001},{"$f":"D30*B30","v":700000.00000000012},{"$f":"INDEX('4e année'!$J$38:$J$42,MATCH('Évaluation des entreprises'!A30,'4e année'!$I$38:$I$42,0))","v":0},{"$f":"E30-F30","v":700000.00000000012},{"$f":"G30/B30","v":0.14000000000000001}]
["Entreprise B",{"$f":"INDEX('Données de base'!$B$14:$B$18,MATCH(A31,'Données de base'!$A$14:$A$18,0))","v":10000000},{"$f":"INDEX('4e année'!$H$38:$H$42,MATCH('Évaluation des entreprises'!A31,'4e année'!$I$38:$I$42,0))","v":{"$error":"#N/A"}},{"$f":"INDEX('Données de base'!$B$6:$B$10,MATCH(C31,'Données de base'!$A$6:$A$10,0))","v":{"$error":"#N/A"}},{"$f":"D31*B31","v":{"$error":"#N/A"}},{"$f":"INDEX('4e année'!$J$38:$J$42,MATCH('Évaluation des entreprises'!A31,'4e année'!$I$38:$I$42,0))","v":{"$error":"#N/A"}},{"$f":"E31-F31","v":{"$error":"#N/A"}},{"$f":"G31/B31","v":{"$error":"#N/A"}}]
["Entreprise C",{"$f":"INDEX('Données de base'!$B$14:$B$18,MATCH(A32,'Données de base'!$A$14:$A$18,0))","v":30000000},{"$f":"INDEX('4e année'!$H$38:$H$42,MATCH('Évaluation des entreprises'!A32,'4e année'!$I$38:$I$42,0))","v":{"$error":"#N/A"}},{"$f":"INDEX('Données de base'!$B$6:$B$10,MATCH(C32,'Données de base'!$A$6:$A$10,0))","v":{"$error":"#N/A"}},{"$f":"D32*B32","v":{"$error":"#N/A"}},{"$f":"INDEX('4e année'!$J$38:$J$42,MATCH('Évaluation des entreprises'!A32,'4e année'!$I$38:$I$42,0))","v":{"$error":"#N/A"}},{"$f":"E32-F32","v":{"$error":"#N/A"}},{"$f":"G32/B32","v":{"$error":"#N/A"}}]
["Entreprise D",{"$f":"INDEX('Données de base'!$B$14:$B$18,MATCH(A33,'Données de base'!$A$14:$A$18,0))","v":400000000},{"$f":"INDEX('4e année'!$H$38:$H$42,MATCH('Évaluation des entreprises'!A33,'4e année'!$I$38:$I$42,0))","v":{"$error":"#N/A"}},{"$f":"INDEX('Données de base'!$B$6:$B$10,MATCH(C33,'Données de base'!$A$6:$A$10,0))","v":{"$error":"#N/A"}},{"$f":"D33*B33","v":{"$error":"#N/A"}},{"$f":"INDEX('4e année'!$J$38:$J$42,MATCH('Évaluation des entreprises'!A33,'4e année'!$I$38:$I$42,0))","v":{"$error":"#N/A"}},{"$f":"E33-F33","v":{"$error":"#N/A"}},{"$f":"G33/B33","v":{"$error":"#N/A"}}]
["Entreprise E",{"$f":"INDEX('Données de base'!$B$14:$B$18,MATCH(A34,'Données de base'!$A$14:$A$18,0))","v":7000000000},{"$f":"INDEX('4e année'!$H$38:$H$42,MATCH('Évaluation des entreprises'!A34,'4e année'!$I$38:$I$42,0))","v":{"$error":"#N/A"}},{"$f":"INDEX('Données de base'!$B$6:$B$10,MATCH(C34,'Données de base'!$A$6:$A$10,0))","v":{"$error":"#N/A"}},{"$f":"D34*B34","v":{"$error":"#N/A"}},{"$f":"INDEX('4e année'!$J$38:$J$42,MATCH('Évaluation des entreprises'!A34,'4e année'!$I$38:$I$42,0))","v":{"$error":"#N/A"}},{"$f":"E34-F34","v":{"$error":"#N/A"}},{"$f":"G34/B34","v":{"$error":"#N/A"}},null,null,"Revenir à l’affectation des dirigeants la 4e année"]

{"sheet":"Graphiques","index":13,"n_rows":2,"n_cols":1,"rows_kept":2,"cut":false,"hidden":false,"merged":[]}
["Théorie des jeux - Hauts salaires"]
["Jeu éducatif sur les salaires des dirigeants - Graphiques"]

{"sheet":"Propositions de solutions","index":14,"n_rows":35,"n_cols":8,"rows_kept":35,"cut":false,"hidden":false,"merged":[[13,1,14,1],[13,0,14,0],[21,1,21,5],[3,7,4,7],[3,1,4,1],[3,2,4,2],[3,3,4,3],[3,4,4,4],[3,5,4,5],[3,6,4,6]]}
["Théorie des jeux - Hauts salaires"]
["Jeu éducatif sur les salaires des dirigeants - Propositions de solutions (cf. Exercice 2 du set d’exercices)"]
[]
[null,"Se reporter aux données de base","Se reporter à la solution ci-dessous","Se reporter aux données de base","Rendements des capitaux (bruts, en %) * Capitalisation","Se reporter à la solution ci-dessous","Bénéfices (bruts, en CHF) - salaire annuel (en CHF)","Bénéfices (nets, en CHF) / capitalisation"]
[]
[]
[null,"Capitalisation","CEO","Rendements bruts des capitaux, en %","Bénéfices bruts, en CHF","Salaire annuel, en CHF","Bénéfices nets, en CHF","Rendements nets des capitaux, en %"]
["Entreprise A",{"$f":"INDEX('Données de base'!$B$14:$B$18,MATCH(A8,'Données de base'!$A$14:$A$18,0))","v":5000000},"Cadre dirigeant/-e normal/-e ",0.1,{"$f":"D8*B8","v":500000},300000,{"$f":"E8-F8","v":200000},{"$f":"G8/B8","v":0.04}]
["Entreprise B",{"$f":"INDEX('Données de base'!$B$14:$B$18,MATCH(A9,'Données de base'!$A$14:$A$18,0))","v":10000000},"Dieter Dim ",0.11,{"$f":"D9*B9","v":1100000},{"$f":"C24","v":350000},{"$f":"E9-F9","v":750000},{"$f":"G9/B9","v":7.4999999999999997E-2}]
["Entreprise C",{"$f":"INDEX('Données de base'!$B$14:$B$18,MATCH(A10,'Données de base'!$A$14:$A$18,0))","v":30000000},"Claudia Custer ",0.12,{"$f":"D10*B10","v":3600000},{"$f":"D25","v":500000},{"$f":"E10-F10","v":3100000},{"$f":"G10/B10","v":0.10333333333333333}]
["Entreprise D",{"$f":"INDEX('Données de base'!$B$14:$B$18,MATCH(A11,'Données de base'!$A$14:$A$18,0))","v":400000000},"Bertha Binnig ",0.13,{"$f":"D11*B11","v":52000000},{"$f":"E26","v":1200000},{"$f":"E11-F11","v":50800000},{"$f":"G11/B11","v":0.127}]
["Entreprise E",{"$f":"INDEX('Données de base'!$B$14:$B$18,MATCH(A12,'Données de base'!$A$14:$A$18,0))","v":7000000000},"Albert Adam ",0.14000000000000001,{"$f":"D12*B12","v":980000000.00000012},{"$f":"F27","v":16300000},{"$f":"E12-F12","v":963700000.00000012},{"$f":"G12/B12","v":0.13767142857142858}]
[]
[null,"Salaire maximal envisageable pour +1% de bénéfices"]
[]
["Entreprise A",{"$f":"B8*0.01","v":50000}]
["Entreprise B",{"$f":"B9*0.01","v":100000}]
["Entreprise C",{"$f":"B10*0.01","v":300000}]
["Entreprise D",{"$f":"B11*0.01","v":4000000}]
["Entreprise E",{"$f":"B12*0.01","v":70000000}]
[]
[null,"Salaire maximal envisageable pour les dirigeants"]
[null,"Cadre dirigeant/-e normal/-e ","Dieter Diem ","Claudia Custer ","Bertha Binnig ","Albert Adam "]
["Entreprise A",300000,{"$f":"B24+B16","v":350000},{"$f":"B24+2*B16","v":400000},{"$f":"B24+3*B16","v":450000},{"$f":"B24+4*B16","v":500000}]
["Entreprise B",300000,{"$f":"B25+B17","v":400000},{"$f":"B25+2*B17","v":500000},{"$f":"B25+3*B17","v":600000},{"$f":"B25+4*B17","v":700000}]
["Entreprise C",300000,{"$f":"B26+B18","v":600000},{"$f":"B26+2*B18","v":900000},{"$f":"B26+3*B18","v":1200000},{"$f":"B26+4*B18","v":1500000}]
["Entreprise D",300000,{"$f":"B27+B19","v":4300000},{"$f":"B27+2*B19","v":8300000},{"$f":"B27+3*B19","v":12300000},{"$f":"B27+4*B19","v":16300000}]
["Entreprise E",300000,{"$f":"B28+B20","v":70300000},{"$f":"B28+2*B20","v":140300000},{"$f":"B28+3*B20","v":210300000},{"$f":"B28+4*B20","v":280300000}]
[]
["Solution: "]
["L’entreprise A engage un cadre dirigeant/-e «normal/-e» à 0,3 mio. "]
["L’entreprise B engage Dieter Dim à 0,35 mio."]
["L’entreprise C engage Claudia Custer à 0,5 mio."]
["L’entreprise D engage Bertha Binnig à 1,2 mio."]
["L’entreprise E engage Albert Adam à 16,3 mio. "]