{"text_format":"1","workbook":"xlsx","n_sheets":15,"sheets":["Anleitung","Grunddaten","Firma A","Firma B","Firma C","Firma D","Firma E","Jahr 1","Jahr 2","Jahr 3","Jahr 4","Auswertung Managerlöhne","Auswertung Firmen","Grafiken","Musterlösung"],"not_rendered":{"charts":6,"images":9,"macros":1,"external_links":0,"defined_names":0,"comments":0,"pivot_tables":0},"unopened":[],"bounds":{"document_bytes":16777216,"sheet_cells":100000,"rows_first":2000,"rows_last":500,"rows_between":2000,"halvings":0,"cell_chars":16384,"cell_head_chars":4096},"cells_cut":0,"cells_raw":0,"read":"whole","date_system":"1900"}

{"sheet":"Anleitung","index":0,"n_rows":91,"n_cols":2,"rows_kept":91,"cut":false,"hidden":false,"merged":[[3,8,5,10],[7,0,8,8],[3,0,5,7],[29,1,33,7],[44,1,51,7],[10,0,23,7],[25,0,27,7],[35,1,38,7],[39,1,42,7],[90,0,91,7],[53,1,60,7],[62,1,70,7],[87,0,88,7],[83,0,85,7],[72,0,75,7],[77,0,81,7]]}
["Spieltheorie - Spitzenverdiener"]
["Anleitung Auswertung Lernspiel Cheflöhne"]
[]
["Hinweis: Die konkrete Spielanleitung befindet sich im Dokument «Spielanleitung Cheflöhne». Es werden hier lediglich die Schritte zur Auswertung des Spiels erläutert. Die Grunddaten des Spiels sind im Tabellenblatt «Grunddaten» hinterlegt."]
[]
[]
[]
["Falls Sie das Spiel bereits einmal durchgeführt haben, müssen Sie hier den Spielstand auf 0 setzen:"]
[]
[]
{"$rows_left_out":82}
{"sheet":"Grunddaten","index":1,"n_rows":18,"n_cols":3,"rows_kept":18,"cut":false,"hidden":false,"merged":[[3,0,3,2],[11,0,11,2],[12,1,12,2],[17,1,17,2],[16,1,16,2],[15,1,15,2],[14,1,14,2],[13,1,13,2]]}
["Spieltheorie - Spitzenverdiener"]
["Grunddaten Lernspiel Cheflöhne"]
[]
["Markt für Manager"]
["Manager","Bruttogewinn (% Firmenkapital) ","Jahreslohn"]
["Albert Adam",0.14000000000000001,"zu verhandeln"]
["Bertha Binnig",0.13,"zu verhandeln"]
["Claudia Custer",0.12,"zu verhandeln"]
["Dieter Diem",0.11,"zu verhandeln"]
["Normal",0.1,300000]
{"$rows_left_out":9}
{"sheet":"Firma A","index":2,"n_rows":22,"n_cols":7,"rows_kept":22,"cut":false,"hidden":false,"merged":[]}
["Spieltheorie - Spitzenverdiener"]
["Lernspiel Cheflöhne - Angebote Firma A"]
[]
["Kapitalisierung:",{"$f":"Grunddaten!B14","v":5000000}]
[]
["1. Jahr","Manager","Jahresgehalt",null,"3. Jahr","Manager","Jahresgehalt"]
[null,"Albert Adam",null,null,null,"Albert Adam"]
[null,"Bertha Binnig",null,null,null,"Bertha Binnig"]
[null,"Claudia Custer",null,null,null,"Claudia Custer"]
[null,"Dieter Diem",null,null,null,"Dieter Diem"]
{"$rows_left_out":13}
{"sheet":"Firma B","index":3,"n_rows":22,"n_cols":7,"rows_kept":22,"cut":false,"hidden":false,"merged":[]}
["Spieltheorie - Spitzenverdiener"]
["Lernspiel Cheflöhne - Angebote Firma B"]
[]
["Kapitalisierung:",{"$f":"Grunddaten!B15","v":10000000}]
[]
["1. Jahr","Manager","Jahresgehalt",null,"3. Jahr","Manager","Jahresgehalt"]
[null,"Albert Adam",null,null,null,"Albert Adam"]
[null,"Bertha Binnig",null,null,null,"Bertha Binnig"]
[null,"Claudia Custer",null,null,null,"Claudia Custer"]
[null,"Dieter Diem",null,null,null,"Dieter Diem"]
{"$rows_left_out":13}
{"sheet":"Firma C","index":4,"n_rows":22,"n_cols":7,"rows_kept":22,"cut":false,"hidden":false,"merged":[]}
["Spieltheorie - Spitzenverdiener"]
["Lernspiel Cheflöhne - Angebote Firma C"]
[]
["Kapitalisierung:",{"$f":"Grunddaten!B16","v":30000000}]
[]
["1. Jahr","Manager","Jahresgehalt",null,"3. Jahr","Manager","Jahresgehalt"]
[null,"Albert Adam",null,null,null,"Albert Adam"]
[null,"Bertha Binnig",null,null,null,"Bertha Binnig"]
[null,"Claudia Custer",null,null,null,"Claudia Custer"]
[null,"Dieter Diem",null,null,null,"Dieter Diem"]
{"$rows_left_out":13}
{"sheet":"Firma D","index":5,"n_rows":22,"n_cols":7,"rows_kept":22,"cut":false,"hidden":false,"merged":[]}
["Spieltheorie - Spitzenverdiener"]
["Lernspiel Cheflöhne - Angebote Firma D"]
[]
["Kapitalisierung:",{"$f":"Grunddaten!B17","v":400000000}]
[]
["1. Jahr","Manager","Jahresgehalt",null,"3. Jahr","Manager","Jahresgehalt"]
[null,"Albert Adam",null,null,null,"Albert Adam"]
[null,"Bertha Binnig",null,null,null,"Bertha Binnig"]
[null,"Claudia Custer",null,null,null,"Claudia Custer"]
[null,"Dieter Diem",null,null,null,"Dieter Diem"]
{"$rows_left_out":13}
{"sheet":"Firma E","index":6,"n_rows":28,"n_cols":7,"rows_kept":28,"cut":false,"hidden":false,"merged":[]}
["Spieltheorie - Spitzenverdiener"]
["Lernspiel Cheflöhne - Angebote Firma E"]
[]
["Kapitalisierung:",{"$f":"Grunddaten!B18","v":7000000000}]
[]
["1. Jahr","Manager","Jahresgehalt",null,"3. Jahr","Manager","Jahresgehalt"]
[null,"Albert Adam",null,null,null,"Albert Adam"]
[null,"Bertha Binnig",null,null,null,"Bertha Binnig"]
[null,"Claudia Custer",null,null,null,"Claudia Custer"]
[null,"Dieter Diem",null,null,null,"Dieter Diem"]
{"$rows_left_out":19}
{"sheet":"Jahr 1","index":7,"n_rows":42,"n_cols":13,"rows_kept":42,"cut":false,"hidden":false,"merged":[[8,7,8,9]]}
["Spieltheorie - Spitzenverdiener"]
["Lernspiel Cheflöhne - Zuweisung Manager (1. Jahr)"]
[]
["Angebote im 1. Jahr","Firma A","Firma B","Firma C","Firma D","Firma E",null,"Maximum","# Maxima","Münzwurf "]
["Albert Adam",{"$f":"'Firma A'!C7","v":0},{"$f":"'Firma B'!C7","v":0},{"$f":"'Firma C'!C7","v":0},{"$f":"'Firma D'!C7","v":0},{"$f":"'Firma E'!C7","v":0},null,{"$f":"MAX(B5:F5)","v":0},{"$f":"COUNTIF(B5:F5,H5)","v":5},{"$f":"IF(I5>1,\"JA\",\"NEIN\")","v":"JA"},"NEIN"]
["Bertha Binnig",{"$f":"'Firma A'!C8","v":0},{"$f":"'Firma B'!C8","v":0},{"$f":"'Firma C'!C8","v":0},{"$f":"'Firma D'!C8","v":0},{"$f":"'Firma E'!C8","v":0},null,{"$f":"MAX(IF(B31:F31>1,IF(ISNUMBER(B31:F31)=TRUE,B6:F6)))","v":0},{"$f":"COUNTIFS(B6:F6,H6,B31:F31,\"<>1\",B31:F31,\"<>NA\")","v":0},{"$f":"IF(I6>1,\"JA\",\"NEIN\")","v":"NEIN"},"NEIN"]
["Claudia Custer",{"$f":"'Firma A'!C9","v":0},{"$f":"'Firma B'!C9","v":0},{"$f":"'Firma C'!C9","v":0},{"$f":"'Firma D'!C9","v":0},{"$f":"'Firma E'!C9","v":0},null,{"$f":"MAX(IF(B32:F32>1,IF(ISNUMBER(B32:F32)=TRUE,B7:F7)))","v":0},{"$f":"COUNTIFS(B7:F7,H7,B32:F32,\"<>1\",B32:F32,\"<>NA\")","v":0},{"$f":"IF(I7>1,\"JA\",\"NEIN\")","v":"NEIN"},"NEIN"]
["Dieter Diem",{"$f":"'Firma A'!C10","v":0},{"$f":"'Firma B'!C10","v":0},{"$f":"'Firma C'!C10","v":0},{"$f":"'Firma D'!C10","v":0},{"$f":"'Firma E'!C10","v":0},null,{"$f":"MAX(IF(B33:F33>1,IF(ISNUMBER(B33:F33)=TRUE,B8:F8)))","v":0},{"$f":"COUNTIFS(B8:F8,H8,B33:F33,\"<>1\",B33:F33,\"<>NA\")","v":0},{"$f":"IF(I8>1,\"JA\",\"NEIN\")","v":"NEIN"},"NEIN"]
["Normal",{"$f":"'Firma A'!C11","v":300000},{"$f":"'Firma B'!C11","v":300000},{"$f":"'Firma C'!C11","v":300000},{"$f":"'Firma D'!C11","v":300000},{"$f":"'Firma E'!C11","v":300000},null,{"$f":"IF(K9=0,\"Sie müssen keinen Münzwurf (mehr) ausführen!\",\"Sie müssen mind. noch einen Münzwurf ausführen!\")","v":"Sie müssen mind. noch einen Münzwurf ausführen!"},null,null,{"$f":"IF(OR(J5=\"JA\",J6=\"JA\",J7=\"JA\",J8=\"JA\"),IF(J5=K5,IF(J6=K6,IF(J7=K7,IF(J8=K8,0,1),1),1),1),0)","v":1}]
[]
{"$rows_left_out":33}
{"sheet":"Jahr 2","index":8,"n_rows":42,"n_cols":13,"rows_kept":42,"cut":false,"hidden":false,"merged":[[8,7,8,9]]}
["Spieltheorie - Spitzenverdiener"]
["Lernspiel Cheflöhne - Zuweisung Manager (2. Jahr)"]
[]
["Angebote im 2. Jahr","Firma A","Firma B","Firma C","Firma D","Firma E",null,"Maximum","# Maxima","Münzwurf"]
["Albert Adam",{"$f":"'Firma A'!C14","v":0},{"$f":"'Firma B'!C14","v":0},{"$f":"'Firma C'!C14","v":0},{"$f":"'Firma D'!C14","v":0},{"$f":"'Firma E'!C14","v":0},null,{"$f":"MAX(B5:F5)","v":0},{"$f":"COUNTIF(B5:F5,H5)","v":5},{"$f":"IF(I5>1,\"JA\",\"NEIN\")","v":"JA"},"NEIN"]
["Bertha Binnig",{"$f":"'Firma A'!C15","v":0},{"$f":"'Firma B'!C15","v":0},{"$f":"'Firma C'!C15","v":0},{"$f":"'Firma D'!C15","v":0},{"$f":"'Firma E'!C15","v":0},null,{"$f":"MAX(IF(B31:F31>1,IF(ISNUMBER(B31:F31)=TRUE,B6:F6)))","v":0},{"$f":"COUNTIFS(B6:F6,H6,B31:F31,\"<>1\",B31:F31,\"<>NA\")","v":0},{"$f":"IF(I6>1,\"JA\",\"NEIN\")","v":"NEIN"},"NEIN"]
["Claudia Custer",{"$f":"'Firma A'!C16","v":0},{"$f":"'Firma B'!C16","v":0},{"$f":"'Firma C'!C16","v":0},{"$f":"'Firma D'!C16","v":0},{"$f":"'Firma E'!C16","v":0},null,{"$f":"MAX(IF(B32:F32>1,IF(ISNUMBER(B32:F32)=TRUE,B7:F7)))","v":0},{"$f":"COUNTIFS(B7:F7,H7,B32:F32,\"<>1\",B32:F32,\"<>NA\")","v":0},{"$f":"IF(I7>1,\"JA\",\"NEIN\")","v":"NEIN"},"NEIN"]
["Dieter Diem",{"$f":"'Firma A'!C17","v":0},{"$f":"'Firma B'!C17","v":0},{"$f":"'Firma C'!C17","v":0},{"$f":"'Firma D'!C17","v":0},{"$f":"'Firma E'!C17","v":0},null,{"$f":"MAX(IF(B33:F33>1,IF(ISNUMBER(B33:F33)=TRUE,B8:F8)))","v":0},{"$f":"COUNTIFS(B8:F8,H8,B33:F33,\"<>1\",B33:F33,\"<>NA\")","v":0},{"$f":"IF(I8>1,\"JA\",\"NEIN\")","v":"NEIN"},"NEIN"]
["Normal",{"$f":"'Firma A'!C18","v":300000},{"$f":"'Firma B'!C18","v":300000},{"$f":"'Firma C'!C18","v":300000},{"$f":"'Firma D'!C18","v":300000},{"$f":"'Firma E'!C18","v":300000},null,{"$f":"IF(K9=0,\"Sie müssen keinen Münzwurf mehr ausführen!\",\"Sie müssen mind. noch einen Münzwurf ausführen!\")","v":"Sie müssen mind. noch einen Münzwurf ausführen!"},null,null,{"$f":"IF(OR(J5=\"JA\",J6=\"JA\",J7=\"JA\",J8=\"JA\"),IF(J5=K5,IF(J6=K6,IF(J7=K7,IF(J8=K8,0,1),1),1),1),0)","v":1}]
[]
{"$rows_left_out":33}
{"sheet":"Jahr 3","index":9,"n_rows":42,"n_cols":13,"rows_kept":42,"cut":false,"hidden":false,"merged":[[8,7,8,9]]}
["Spieltheorie - Spitzenverdiener"]
["Lernspiel Cheflöhne - Zuweisung Manager (3. Jahr)"]
[]
["Angebote im 3. Jahr","Firma A","Firma B","Firma C","Firma D","Firma E",null,"Maximum","# Maxima","Münzwurf"]
["Albert Adam",{"$f":"'Firma A'!G7","v":0},{"$f":"'Firma B'!G7","v":0},{"$f":"'Firma C'!G7","v":0},{"$f":"'Firma D'!G7","v":0},{"$f":"'Firma E'!G7","v":0},null,{"$f":"MAX(B5:F5)","v":0},{"$f":"COUNTIF(B5:F5,H5)","v":5},{"$f":"IF(I5>1,\"JA\",\"NEIN\")","v":"JA"},"NEIN"]
["Bertha Binnig",{"$f":"'Firma A'!G8","v":0},{"$f":"'Firma B'!G8","v":0},{"$f":"'Firma C'!G8","v":0},{"$f":"'Firma D'!G8","v":0},{"$f":"'Firma E'!G8","v":0},null,{"$f":"MAX(IF(B31:F31>1,IF(ISNUMBER(B31:F31)=TRUE,B6:F6)))","v":0},{"$f":"COUNTIFS(B6:F6,H6,B31:F31,\"<>1\",B31:F31,\"<>NA\")","v":0},{"$f":"IF(I6>1,\"JA\",\"NEIN\")","v":"NEIN"},"NEIN"]
["Claudia Custer",{"$f":"'Firma A'!G9","v":0},{"$f":"'Firma B'!G9","v":0},{"$f":"'Firma C'!G9","v":0},{"$f":"'Firma D'!G9","v":0},{"$f":"'Firma E'!G9","v":0},null,{"$f":"MAX(IF(B32:F32>1,IF(ISNUMBER(B32:F32)=TRUE,B7:F7)))","v":0},{"$f":"COUNTIFS(B7:F7,H7,B32:F32,\"<>1\",B32:F32,\"<>NA\")","v":0},{"$f":"IF(I7>1,\"JA\",\"NEIN\")","v":"NEIN"},"NEIN"]
["Dieter Diem",{"$f":"'Firma A'!G10","v":0},{"$f":"'Firma B'!G10","v":0},{"$f":"'Firma C'!G10","v":0},{"$f":"'Firma D'!G10","v":0},{"$f":"'Firma E'!G10","v":0},null,{"$f":"MAX(IF(B33:F33>1,IF(ISNUMBER(B33:F33)=TRUE,B8:F8)))","v":0},{"$f":"COUNTIFS(B8:F8,H8,B33:F33,\"<>1\",B33:F33,\"<>NA\")","v":0},{"$f":"IF(I8>1,\"JA\",\"NEIN\")","v":"NEIN"},"NEIN"]
["Normal",{"$f":"'Firma A'!G11","v":300000},{"$f":"'Firma B'!G11","v":300000},{"$f":"'Firma C'!G11","v":300000},{"$f":"'Firma D'!G11","v":300000},{"$f":"'Firma E'!G11","v":300000},null,{"$f":"IF(K9=0,\"Sie müssen keinen Münzwurf mehr ausführen!\",\"Sie müssen mind. noch einen Münzwurf ausführen!\")","v":"Sie müssen mind. noch einen Münzwurf ausführen!"},null,null,{"$f":"IF(OR(J5=\"JA\",J6=\"JA\",J7=\"JA\",J8=\"JA\"),IF(J5=K5,IF(J6=K6,IF(J7=K7,IF(J8=K8,0,1),1),1),1),0)","v":1}]
[]
{"$rows_left_out":33}
{"sheet":"Jahr 4","index":10,"n_rows":42,"n_cols":13,"rows_kept":42,"cut":false,"hidden":false,"merged":[[8,7,8,9]]}
["Spieltheorie - Spitzenverdiener"]
["Lernspiel Cheflöhne - Zuweisung Manager (4. Jahr)"]
[]
["Angebote im 4. Jahr","Firma A","Firma B","Firma C","Firma D","Firma E",null,"Maximum","# Maxima","Münzwurf"]
["Albert Adam",{"$f":"'Firma A'!G14","v":0},{"$f":"'Firma B'!G14","v":0},{"$f":"'Firma C'!G14","v":0},{"$f":"'Firma D'!G14","v":0},{"$f":"'Firma E'!G14","v":0},null,{"$f":"MAX(B5:F5)","v":0},{"$f":"COUNTIF(B5:F5,H5)","v":5},{"$f":"IF(I5>1,\"JA\",\"NEIN\")","v":"JA"},"NEIN"]
["Bertha Binnig",{"$f":"'Firma A'!G15","v":0},{"$f":"'Firma B'!G15","v":0},{"$f":"'Firma C'!G15","v":0},{"$f":"'Firma D'!G15","v":0},{"$f":"'Firma E'!G15","v":0},null,{"$f":"MAX(IF(B31:F31>1,IF(ISNUMBER(B31:F31)=TRUE,B6:F6)))","v":0},{"$f":"COUNTIFS(B6:F6,H6,B31:F31,\"<>1\",B31:F31,\"<>NA\")","v":0},{"$f":"IF(I6>1,\"JA\",\"NEIN\")","v":"NEIN"},"NEIN"]
["Claudia Custer",{"$f":"'Firma A'!G16","v":0},{"$f":"'Firma B'!G16","v":0},{"$f":"'Firma C'!G16","v":0},{"$f":"'Firma D'!G16","v":0},{"$f":"'Firma E'!G16","v":0},null,{"$f":"MAX(IF(B32:F32>1,IF(ISNUMBER(B32:F32)=TRUE,B7:F7)))","v":0},{"$f":"COUNTIFS(B7:F7,H7,B32:F32,\"<>1\",B32:F32,\"<>NA\")","v":0},{"$f":"IF(I7>1,\"JA\",\"NEIN\")","v":"NEIN"},"NEIN"]
["Dieter Diem",{"$f":"'Firma A'!G17","v":0},{"$f":"'Firma B'!G17","v":0},{"$f":"'Firma C'!G17","v":0},{"$f":"'Firma D'!G17","v":0},{"$f":"'Firma E'!G17","v":0},null,{"$f":"MAX(IF(B33:F33>1,IF(ISNUMBER(B33:F33)=TRUE,B8:F8)))","v":0},{"$f":"COUNTIFS(B8:F8,H8,B33:F33,\"<>1\",B33:F33,\"<>NA\")","v":0},{"$f":"IF(I8>1,\"JA\",\"NEIN\")","v":"NEIN"},"NEIN"]
["Normal",{"$f":"'Firma A'!G18","v":300000},{"$f":"'Firma B'!G18","v":300000},{"$f":"'Firma C'!G18","v":300000},{"$f":"'Firma D'!G18","v":300000},{"$f":"'Firma E'!G18","v":300000},null,{"$f":"IF(K9=0,\"Sie müssen keinen Münzwurf mehr ausführen!\",\"Sie müssen mind. noch einen Münzwurf ausführen!\")","v":"Sie müssen mind. noch einen Münzwurf ausführen!"},null,null,{"$f":"IF(OR(J5=\"JA\",J6=\"JA\",J7=\"JA\",J8=\"JA\"),IF(J5=K5,IF(J6=K6,IF(J7=K7,IF(J8=K8,0,1),1),1),1),0)","v":1}]
[]
{"$rows_left_out":33}
{"sheet":"Auswertung Managerlöhne","index":11,"n_rows":9,"n_cols":8,"rows_kept":9,"cut":false,"hidden":false,"merged":[]}
["Spieltheorie - Spitzenverdiener"]
["Lernspiel Cheflöhne - Auswertung Jahreslohn Manager"]
[]
["CEO","1. Jahr","2. Jahr","3. Jahr","4. Jahr"]
["Albert Adam",{"$f":"INDEX('Jahr 1'!$J$38:$J$42,MATCH(A5,'Jahr 1'!$H$38:$H$42,0))","v":0},{"$f":"INDEX('Jahr 2'!$J$38:$J$42,MATCH(A5,'Jahr 2'!$H$38:$H$42,0))","v":0},{"$f":"INDEX('Jahr 3'!$J$38:$J$42,MATCH(A5,'Jahr 3'!$H$38:$H$42,0))","v":0},{"$f":"INDEX('Jahr 4'!$J$38:$J$42,MATCH(A5,'Jahr 4'!$H$38:$H$42,0))","v":0}]
["Bertha Binnig",{"$f":"INDEX('Jahr 1'!$J$38:$J$42,MATCH(A6,'Jahr 1'!$H$38:$H$42,0))","v":{"$error":"#N/A"}},{"$f":"INDEX('Jahr 2'!$J$38:$J$42,MATCH(A6,'Jahr 2'!$H$38:$H$42,0))","v":{"$error":"#N/A"}},{"$f":"INDEX('Jahr 3'!$J$38:$J$42,MATCH(A6,'Jahr 3'!$H$38:$H$42,0))","v":{"$error":"#N/A"}},{"$f":"INDEX('Jahr 4'!$J$38:$J$42,MATCH(A6,'Jahr 4'!$H$38:$H$42,0))","v":{"$error":"#N/A"}}]
["Claudia Custer",{"$f":"INDEX('Jahr 1'!$J$38:$J$42,MATCH(A7,'Jahr 1'!$H$38:$H$42,0))","v":{"$error":"#N/A"}},{"$f":"INDEX('Jahr 2'!$J$38:$J$42,MATCH(A7,'Jahr 2'!$H$38:$H$42,0))","v":{"$error":"#N/A"}},{"$f":"INDEX('Jahr 3'!$J$38:$J$42,MATCH(A7,'Jahr 3'!$H$38:$H$42,0))","v":{"$error":"#N/A"}},{"$f":"INDEX('Jahr 4'!$J$38:$J$42,MATCH(A7,'Jahr 4'!$H$38:$H$42,0))","v":{"$error":"#N/A"}}]
["Dieter Diem",{"$f":"INDEX('Jahr 1'!$J$38:$J$42,MATCH(A8,'Jahr 1'!$H$38:$H$42,0))","v":{"$error":"#N/A"}},{"$f":"INDEX('Jahr 2'!$J$38:$J$42,MATCH(A8,'Jahr 2'!$H$38:$H$42,0))","v":{"$error":"#N/A"}},{"$f":"INDEX('Jahr 3'!$J$38:$J$42,MATCH(A8,'Jahr 3'!$H$38:$H$42,0))","v":{"$error":"#N/A"}},{"$f":"INDEX('Jahr 4'!$J$38:$J$42,MATCH(A8,'Jahr 4'!$H$38:$H$42,0))","v":{"$error":"#N/A"}}]
["Normal",{"$f":"INDEX('Jahr 1'!$J$38:$J$42,MATCH(A9,'Jahr 1'!$H$38:$H$42,0))","v":{"$error":"#N/A"}},{"$f":"INDEX('Jahr 2'!$J$38:$J$42,MATCH(A9,'Jahr 2'!$H$38:$H$42,0))","v":{"$error":"#N/A"}},{"$f":"INDEX('Jahr 3'!$J$38:$J$42,MATCH(A9,'Jahr 3'!$H$38:$H$42,0))","v":{"$error":"#N/A"}},{"$f":"INDEX('Jahr 4'!$J$38:$J$42,MATCH(A9,'Jahr 4'!$H$38:$H$42,0))","v":{"$error":"#N/A"}},null,null,"Vorwärts zur Firmenauswertung"]

{"sheet":"Auswertung Firmen","index":12,"n_rows":34,"n_cols":11,"rows_kept":34,"cut":false,"hidden":false,"merged":[[3,1,5,1],[3,7,5,7],[3,6,5,6],[3,5,5,5],[3,4,5,4],[3,3,5,3],[3,2,5,2]]}
["Spieltheorie - Spitzenverdiener"]
["Lernspiel Cheflöhne - Auswertung Firmen"]
[]
[null,"Siehe Grunddaten","Siehe entspr. Jahr","Siehe Grunddaten","Kapitalrendite (brutto, %) * Kapitalisierung","Siehe entspr. Jahr","Gewinn (brutto, CHF) - Jahresgehalt (CHF)","Gewinn (netto, CHF) / Kapitalisierung",null,null,"Zurück zu Firma A"]
[]
[null,null,null,null,null,null,null,null,null,null,"Vorwärts zu den Grafiken"]
[]
["1. Jahr","Kapitalisierung","CEO","Kapitalrendite brutto, in %","Gewinn brutto, in CHF","Jahresgehalt, in CHF","Gewinn netto, in CHF","Kapitalrendite netto, in %"]
["Firma A",{"$f":"INDEX(Grunddaten!$B$14:$B$18,MATCH(A9,Grunddaten!$A$14:$A$18,0))","v":5000000},{"$f":"INDEX('Jahr 1'!$H$38:$H$42,MATCH('Auswertung Firmen'!A9,'Jahr 1'!$I$38:$I$42,0))","v":"Albert Adam"},{"$f":"INDEX(Grunddaten!$B$6:$B$10,MATCH(C9,Grunddaten!$A$6:$A$10,0))","v":0.14000000000000001},{"$f":"D9*B9","v":700000.00000000012},{"$f":"INDEX('Jahr 1'!$J$38:$J$42,MATCH('Auswertung Firmen'!A9,'Jahr 1'!$I$38:$I$42,0))","v":0},{"$f":"E9-F9","v":700000.00000000012},{"$f":"G9/B9","v":0.14000000000000001}]
["Firma B",{"$f":"INDEX(Grunddaten!$B$14:$B$18,MATCH(A10,Grunddaten!$A$14:$A$18,0))","v":10000000},{"$f":"INDEX('Jahr 1'!$H$38:$H$42,MATCH('Auswertung Firmen'!A10,'Jahr 1'!$I$38:$I$42,0))","v":{"$error":"#N/A"}},{"$f":"INDEX(Grunddaten!$B$6:$B$10,MATCH(C10,Grunddaten!$A$6:$A$10,0))","v":{"$error":"#N/A"}},{"$f":"D10*B10","v":{"$error":"#N/A"}},{"$f":"INDEX('Jahr 1'!$J$38:$J$42,MATCH('Auswertung Firmen'!A10,'Jahr 1'!$I$38:$I$42,0))","v":{"$error":"#N/A"}},{"$f":"E10-F10","v":{"$error":"#N/A"}},{"$f":"G10/B10","v":{"$error":"#N/A"}}]
{"$rows_left_out":25}
{"sheet":"Grafiken","index":13,"n_rows":2,"n_cols":1,"rows_kept":2,"cut":false,"hidden":false,"merged":[]}
["Spieltheorie - Spitzenverdiener"]
["Lernspiel Cheflöhne - Grafiken"]

{"sheet":"Musterlösung","index":14,"n_rows":35,"n_cols":8,"rows_kept":35,"cut":false,"hidden":false,"merged":[[13,1,14,1],[13,0,14,0],[21,1,21,5],[3,7,4,7],[3,1,4,1],[3,2,4,2],[3,3,4,3],[3,4,4,4],[3,5,4,5],[3,6,4,6]]}
["Spieltheorie - Spitzenverdiener"]
["Lernspiel Cheflöhne - Musterlösung (vgl. Aufgabe 2 im Aufgabenset)"]
[]
[null,"Siehe Grunddaten","Siehe Lösung unten","Siehe Grunddaten","Kapitalrendite (brutto, %) * Kapitalisierung","Siehe Lösung unten","Gewinn (brutto, CHF) - Jahresgehalt (CHF)","Gewinn (netto, CHF) / Kapitalisierung"]
[]
[]
[null,"Kapitalisierung","CEO","Kapitalrendite brutto, in %","Gewinn brutto, in CHF","Jahresgehalt, in CHF","Gewinn netto, in CHF","Kapitalrendite netto, in %"]
["Firma A",{"$f":"INDEX(Grunddaten!$B$14:$B$18,MATCH(A8,Grunddaten!$A$14:$A$18,0))","v":5000000},"Normale Führungsperson ",0.1,{"$f":"D8*B8","v":500000},300000,{"$f":"E8-F8","v":200000},{"$f":"G8/B8","v":0.04}]
["Firma B",{"$f":"INDEX(Grunddaten!$B$14:$B$18,MATCH(A9,Grunddaten!$A$14:$A$18,0))","v":10000000},"Dieter Dim ",0.11,{"$f":"D9*B9","v":1100000},{"$f":"C24","v":350000},{"$f":"E9-F9","v":750000},{"$f":"G9/B9","v":7.4999999999999997E-2}]
["Firma C",{"$f":"INDEX(Grunddaten!$B$14:$B$18,MATCH(A10,Grunddaten!$A$14:$A$18,0))","v":30000000},"Claudia Custer ",0.12,{"$f":"D10*B10","v":3600000},{"$f":"D25","v":500000},{"$f":"E10-F10","v":3100000},{"$f":"G10/B10","v":0.10333333333333333}]
{"$rows_left_out":25}